Data Publisher,Dataset,Dataset Rights,Collector name,Collector number,Field number,GUID,Date collected,Institution code,Collection code,Catalogue number,Basis of record,Image url,Last indexed,Identifier,Identification date,Scientific name,Author,Scientific name (interpreted),Kingdom,Phylum,Class,Order,Family,Genus,Country,Country (interpreted),Locality,County,Continent or Ocean,State/Province,Region,Publisher country,Latitude,Longitude,Coordinate precision,Cell id,Centi cell id,Min depth,Max depth,Max depth,Min altitude,Max altitude,Altitude precision,GBIF portal url,GBIF webservice url
"National Institute of Genetics, ROIS","Herbarium Specimens of Museum of Nature and Human Activities, Hyogo Pref., Japan",,,,,,,HYO,VP,C1-136084,Specimen,,27:37.0,T.Fujii,,Thalictrum watanabei,,Thalictrum watanabei,Plantae,Magnoliophyta,,,Ranunculaceae,Thalictrum,Japan,Japan,"Tokushima Pref.; Miyosi-gun, Nigashisoyyamura, Summit of Tsurugi Mt.",,,Tokushima,Eastern Asia,Japan,,,,,,,,,,,,http://data.gbif.org/occurrences/323529299,http://data.gbif.org/ws/rest/occurrence/get?key=323529299
"National Museum of Nature and Science, Japan","Herbarium Specimens of Museum of Nature and Human Activities, Hyogo Prefecture, Japan",,,,,,,HYO,HYO-C,C1-136084,Specimen,,29:20.0,,,Thalictrum watanabei Yatabe,Yatabe,Thalictrum watanabei Yatabe,Plantae,Magnoliophyta,Magnoliopsida,Ranunculales,Ranunculaceae,Thalictrum,Japan,Japan,,,,Tokushima,Eastern Asia,Japan,,,,,,,,,,,,http://data.gbif.org/occurrences/177385162,http://data.gbif.org/ws/rest/occurrence/get?key=177385162
"National Museum of Nature and Science, Japan",Kochi Prefectural Makino Botanical Garden,,,,,,,MBK,MBK,174962,Specimen,,04:48.0,,,Thalictrum watanabei Yatabe,,Thalictrum watanabei Yatabe,Plantae,,,Ranunculales,Ranunculaceae,Thalictrum,Japan,Japan,,,,Pref. Kochi,Eastern Asia,Japan,,,,,,,,,,,,http://data.gbif.org/occurrences/143975626,http://data.gbif.org/ws/rest/occurrence/get?key=143975626
"National Museum of Nature and Science, Japan",Kochi Prefectural Makino Botanical Garden,,,,,,,MBK,MBK,4673,Specimen,,04:44.0,,,Thalictrum watanabei Yatabe,,Thalictrum watanabei Yatabe,Plantae,,,Ranunculales,Ranunculaceae,Thalictrum,Japan,Japan,,,,Pref. Kochi,Eastern Asia,Japan,,,,,,,,,,,,http://data.gbif.org/occurrences/143974689,http://data.gbif.org/ws/rest/occurrence/get?key=143974689
"National Museum of Nature and Science, Japan",Kochi Prefectural Makino Botanical Garden,,,,,,,MBK,MBK,175552,Specimen,,04:48.0,,,Thalictrum watanabei Yatabe,,Thalictrum watanabei Yatabe,Plantae,,,Ranunculales,Ranunculaceae,Thalictrum,Japan,Japan,,,,Pref. Kochi,Eastern Asia,Japan,,,,,,,,,,,,http://data.gbif.org/occurrences/143975641,http://data.gbif.org/ws/rest/occurrence/get?key=143975641
"National Museum of Nature and Science, Japan",Kochi Prefectural Makino Botanical Garden,,,,,,,MBK,MBK,173060,Specimen,,04:48.0,,,Thalictrum watanabei Yatabe,,Thalictrum watanabei Yatabe,Plantae,,,Ranunculales,Ranunculaceae,Thalictrum,Japan,Japan,,,,Pref. Kochi,Eastern Asia,Japan,,,,,,,,,,,,http://data.gbif.org/occurrences/143975574,http://data.gbif.org/ws/rest/occurrence/get?key=143975574
"National Museum of Nature and Science, Japan",Kochi Prefectural Makino Botanical Garden,,,,,,,MBK,MBK,4661,Specimen,,04:44.0,,,Thalictrum watanabei Yatabe,,Thalictrum watanabei Yatabe,Plantae,,,Ranunculales,Ranunculaceae,Thalictrum,Japan,Japan,,,,Pref. Kochi,Eastern Asia,Japan,,,,,,,,,,,,http://data.gbif.org/occurrences/143974680,http://data.gbif.org/ws/rest/occurrence/get?key=143974680
"National Museum of Nature and Science, Japan","Plant specimens depodited in Osaka Museum of Natural History, Japan.",,,,,,,OSA,C,OSA17105,Specimen,,24:53.0,,,Thalictrum watanabei Yatabe,Yatabe,Thalictrum watanabei Yatabe,Plantae,,,,Ranunculaceae,Thalictrum,Japan,Japan,,Yoshino-gun Kawakami-mura,,Nara Prefecture,Eastern Asia,Japan,,,,,,,,,,,,http://data.gbif.org/occurrences/295175085,http://data.gbif.org/ws/rest/occurrence/get?key=295175085
"Royal Botanic Gardens, Kew","Royal Botanic Gardens, Kew",http://www.kew.org/aboutus/legal.html,"Watanabe, K.",s.n.,,,1892-07-11 00:00:00.0,K,Herbarium,K000694168,Specimen,,26:56.0,,,Thalictrum watanabei Yatabe,Yatabe,Thalictrum watanabei Yatabe,Plantae,,,,RANUNCULACEAE,Thalictrum,Japan,Japan,"Nanokawa, Tosa.",,,,Eastern Asia,United Kingdom,,,,,,,,,,,,http://data.gbif.org/occurrences/286851161,http://data.gbif.org/ws/rest/occurrence/get?key=286851161
"National Museum of Nature and Science, Japan","Plant specimens depodited in Osaka Museum of Natural History, Japan.",,,,,,,OSA,OSA,93329,Specimen,,24:52.0,,,Thalictrum filamentosum Maxim. var. watanabei (Yatabe) Kitam.,Maxim.,Thalictrum filamentosum var. watanabei (Yatabe) Kitam.,Plantae,,,,Ranunculaceae,Thalictrum,Japan,Japan,,Yoshino-gun Kamikitayamamura,,Nara,Eastern Asia,Japan,34.4069,135.798,,44955,47,,,,,,,http://data.gbif.org/occurrences/204393056,http://data.gbif.org/ws/rest/occurrence/get?key=204393056
"National Museum of Nature and Science, Japan","Plant specimens depodited in Osaka Museum of Natural History, Japan.",,,,,,,OSA,OSA,191734,Specimen,,24:52.0,,,Thalictrum filamentosum Maxim. var. watanabei (Yatabe) Kitam.,Maxim.,Thalictrum filamentosum var. watanabei (Yatabe) Kitam.,Plantae,,,,Ranunculaceae,Thalictrum,Japan,Japan,,Yoshino-gun Totsukawamura,,Nara,Eastern Asia,Japan,34.4069,135.798,,44955,47,,,,,,,http://data.gbif.org/occurrences/204393060,http://data.gbif.org/ws/rest/occurrence/get?key=204393060
"National Museum of Nature and Science, Japan","Plant specimens depodited in Osaka Museum of Natural History, Japan.",,,,,,,OSA,OSA,35192,Specimen,,24:52.0,,,Thalictrum filamentosum Maxim. var. watanabei (Yatabe) Kitam.,Maxim.,Thalictrum filamentosum var. watanabei (Yatabe) Kitam.,Plantae,,,,Ranunculaceae,Thalictrum,Japan,Japan,,Yoshino-gun Totsukawamura,,Nara,Eastern Asia,Japan,34.4069,135.798,,44955,47,,,,,,,http://data.gbif.org/occurrences/204393058,http://data.gbif.org/ws/rest/occurrence/get?key=204393058
"National Museum of Nature and Science, Japan","Plant specimens depodited in Osaka Museum of Natural History, Japan.",,,,,,,OSA,C,OSA35192,Specimen,,24:53.0,,,Thalictrum filamentosum Maxim. var. watanabei (Yatabe) Kitam.,Maxim.,Thalictrum filamentosum var. watanabei (Yatabe) Kitam.,Plantae,,,,Ranunculaceae,Thalictrum,Japan,Japan,Mt. Tamaki-yama,Yoshino-gun Totsugawa-mura,,Nara Prefecture,Eastern Asia,Japan,,,,,,,,,,,,http://data.gbif.org/occurrences/295175164,http://data.gbif.org/ws/rest/occurrence/get?key=295175164
"National Museum of Nature and Science, Japan","Plant specimens depodited in Osaka Museum of Natural History, Japan.",,,,,,,OSA,OSA,28164,Specimen,,24:52.0,,,Thalictrum filamentosum Maxim. var. watanabei (Yatabe) Kitam.,Maxim.,Thalictrum filamentosum var. watanabei (Yatabe) Kitam.,Plantae,,,,Ranunculaceae,Thalictrum,Japan,Japan,,Yoshino-gun Kamikitayamamura,,Nara,Eastern Asia,Japan,34.4069,135.798,,44955,47,,,,,,,http://data.gbif.org/occurrences/204393057,http://data.gbif.org/ws/rest/occurrence/get?key=204393057
"National Museum of Nature and Science, Japan","Plant specimens depodited in Osaka Museum of Natural History, Japan.",,,,,,,OSA,OSA,191733,Specimen,,24:52.0,,,Thalictrum filamentosum Maxim. var. watanabei (Yatabe) Kitam.,Maxim.,Thalictrum filamentosum var. watanabei (Yatabe) Kitam.,Plantae,,,,Ranunculaceae,Thalictrum,Japan,Japan,,Yoshino-gun Totsukawamura,,Nara,Eastern Asia,Japan,34.4069,135.798,,44955,47,,,,,,,http://data.gbif.org/occurrences/204393059,http://data.gbif.org/ws/rest/occurrence/get?key=204393059
"National Museum of Nature and Science, Japan","Plant specimens depodited in Osaka Museum of Natural History, Japan.",,,,,,,OSA,OSA,191732,Specimen,,24:52.0,,,Thalictrum filamentosum Maxim. var. watanabei (Yatabe) Kitam.,Maxim.,Thalictrum filamentosum var. watanabei (Yatabe) Kitam.,Plantae,,,,Ranunculaceae,Thalictrum,Japan,Japan,,Yoshino-gun Kamikitayamamura,,Nara,Eastern Asia,Japan,34.4069,135.798,,44955,47,,,,,,,http://data.gbif.org/occurrences/204393061,http://data.gbif.org/ws/rest/occurrence/get?key=204393061
"National Museum of Nature and Science, Japan","Plant specimens depodited in Osaka Museum of Natural History, Japan.",,,,,,,OSA,OSA,108043,Specimen,,24:52.0,,,Thalictrum filamentosum Maxim. var. watanabei (Yatabe) Kitam.,Maxim.,Thalictrum filamentosum var. watanabei (Yatabe) Kitam.,Plantae,,,,Ranunculaceae,Thalictrum,Japan,Japan,,Yoshino-gun Totsukawamura,,Nara,Eastern Asia,Japan,34.4069,135.798,,44955,47,,,,,,,http://data.gbif.org/occurrences/204393055,http://data.gbif.org/ws/rest/occurrence/get?key=204393055
