Data Publisher,Dataset,Dataset Rights,Collector name,Collector number,Field number,GUID,Date collected,Institution code,Collection code,Catalogue number,Basis of record,Image url,Last indexed,Identifier,Identification date,Scientific name,Author,Scientific name (interpreted),Kingdom,Phylum,Class,Order,Family,Genus,Country,Country (interpreted),Locality,County,Continent or Ocean,State/Province,Region,Publisher country,Latitude,Longitude,Coordinate precision,Cell id,Centi cell id,Min depth,Max depth,Max depth,Min altitude,Max altitude,Altitude precision,GBIF portal url,GBIF webservice url
"National Institute of Genetics, ROIS","Herbarium Specimens of Museum of Nature and Human Activities, Hyogo Pref., Japan",,,,,,,HYO,VP,C1-117135,Specimen,,17:57.0,T.Kobayashi,,Cardamine fallax,,Cardamine fallax,Plantae,Magnoliophyta,,,Cruciferae,Cardamine,Japan,Japan,"Hyogo Pref.; Kobe-shi, Kita-ku, Dohjo-cho.",,,Hyogo,Eastern Asia,Japan,135.283,34.85,,,,,,,100,300,,http://data.gbif.org/occurrences/323452058,http://data.gbif.org/ws/rest/occurrence/get?key=323452058
"National Institute of Genetics, ROIS","Herbarium Specimens of Museum of Nature and Human Activities, Hyogo Pref., Japan",,,,,,,HYO,VP,C1-122422,Specimen,,20:47.0,,,Cardamine fallax,,Cardamine fallax,Plantae,Magnoliophyta,,,Cruciferae,Cardamine,Japan,Japan,"Hyogo Pref.; Mihara-gun, Seidan-cho, Matsuho",,,Hyogo,Eastern Asia,Japan,134.7,35.0167,,,,,,,400,450,,http://data.gbif.org/occurrences/323482609,http://data.gbif.org/ws/rest/occurrence/get?key=323482609
"National Institute of Genetics, ROIS","Herbarium Specimens of Museum of Nature and Human Activities, Hyogo Pref., Japan",,,,,,,HYO,VP,C1-160514,Specimen,,21:22.0,,,Cardamine fallax,,Cardamine fallax,Plantae,Magnoliophyta,,,Cruciferae,Cardamine,Japan,Japan,"Hyogo Pref.; Nishinomiya-shi, Shiose-cho-namaze to Takedao.",,,Hyogo,Eastern Asia,Japan,135.317,34.8167,,,,,,,,,,http://data.gbif.org/occurrences/323488782,http://data.gbif.org/ws/rest/occurrence/get?key=323488782
"National Institute of Genetics, ROIS","Herbarium Specimens of Museum of Nature and Human Activities, Hyogo Pref., Japan",,,,,,,HYO,VP,C1-019281,Specimen,,18:53.0,,,Cardamine fallax,,Cardamine fallax,Plantae,Magnoliophyta,,,Cruciferae,Cardamine,Japan,Japan,"Hyogo Pref.; Mihara-gun, Seidan-cho, Matsuho",,,Hyogo,Eastern Asia,Japan,,,,,,,,,,,,http://data.gbif.org/occurrences/323462573,http://data.gbif.org/ws/rest/occurrence/get?key=323462573
"National Institute of Genetics, ROIS","Herbarium Specimens of Museum of Nature and Human Activities, Hyogo Pref., Japan",,,,,,,HYO,VP,C1-008708,Specimen,,20:16.0,,,Cardamine fallax,,Cardamine fallax,Plantae,Magnoliophyta,,,Cruciferae,Cardamine,Japan,Japan,"Hyogo Pref.; Mihara-gun, Seidan-cho, Matsuho",,,Hyogo,Eastern Asia,Japan,134.633,35.5333,,,,,,,,,,http://data.gbif.org/occurrences/323477155,http://data.gbif.org/ws/rest/occurrence/get?key=323477155
"National Institute of Genetics, ROIS","Herbarium Specimens of Museum of Nature and Human Activities, Hyogo Pref., Japan",,,,,,,HYO,VP,C1-105123,Specimen,,21:24.0,,,Cardamine fallax,,Cardamine fallax,Plantae,Magnoliophyta,,,Cruciferae,Cardamine,Japan,Japan,"Hyogo Pref.; Nishinomiya-shi, Takedao.",,,Hyogo,Eastern Asia,Japan,135.3,34.85,,,,,,,,,,http://data.gbif.org/occurrences/323489218,http://data.gbif.org/ws/rest/occurrence/get?key=323489218
"National Institute of Genetics, ROIS","Herbarium Specimens of Museum of Nature and Human Activities, Hyogo Pref., Japan",,,,,,,HYO,VP,C1-164765,Specimen,,21:01.0,,,Cardamine fallax,,Cardamine fallax,Plantae,Magnoliophyta,,,Cruciferae,Cardamine,Japan,Japan,"Hyogo Pref.; Mihara-gun, Seidan-cho, Matsuho",,,Hyogo,Eastern Asia,Japan,135.083,34.6833,,,,,,,100,200,,http://data.gbif.org/occurrences/323484880,http://data.gbif.org/ws/rest/occurrence/get?key=323484880
"National Institute of Genetics, ROIS","Herbarium Specimens of Museum of Nature and Human Activities, Hyogo Pref., Japan",,,,,,,HYO,VP,C1-160179,Specimen,,21:22.0,,,Cardamine fallax,,Cardamine fallax,Plantae,Magnoliophyta,,,Cruciferae,Cardamine,Japan,Japan,"Hyogo Pref.; Nishinomiya-shi, Shiose-cho-namaze to Takedao.",,,Hyogo,Eastern Asia,Japan,135.317,34.8167,,,,,,,,,,http://data.gbif.org/occurrences/323488772,http://data.gbif.org/ws/rest/occurrence/get?key=323488772
"National Institute of Genetics, ROIS","Herbarium Specimens of Museum of Nature and Human Activities, Hyogo Pref., Japan",,,,,,,HYO,VP,C1-106137,Specimen,,19:50.0,,,Cardamine fallax,,Cardamine fallax,Plantae,Magnoliophyta,,,Cruciferae,Cardamine,Japan,Japan,"Hyogo Pref.; Mihara-gun, Seidan-cho, Matsuho",,,Hyogo,Eastern Asia,Japan,134.517,35.1667,,,,,,,300,400,,http://data.gbif.org/occurrences/323472397,http://data.gbif.org/ws/rest/occurrence/get?key=323472397
"National Institute of Genetics, ROIS","Herbarium Specimens of Museum of Nature and Human Activities, Hyogo Pref., Japan",,,,,,,HYO,VP,C1-132505,Specimen,,25:13.0,,,Cardamine fallax,,Cardamine fallax,Plantae,Magnoliophyta,,,Cruciferae,Cardamine,Japan,Japan,"Hyogo Pref.; Takarazuka-shi, Takedao.",,,Hyogo,Eastern Asia,Japan,135.3,34.85,,,,,,,,,,http://data.gbif.org/occurrences/323515080,http://data.gbif.org/ws/rest/occurrence/get?key=323515080
"National Institute of Genetics, ROIS","Herbarium Specimens of Museum of Nature and Human Activities, Hyogo Pref., Japan",,,,,,,HYO,VP,C1-115067,Specimen,,19:03.0,,,Cardamine fallax,,Cardamine fallax,Plantae,Magnoliophyta,,,Cruciferae,Cardamine,Japan,Japan,"Hyogo Pref.; Mihara-gun, Seidan-cho, Matsuho",,,Hyogo,Eastern Asia,Japan,135.267,34.9667,,,,,,,220,220,,http://data.gbif.org/occurrences/323464305,http://data.gbif.org/ws/rest/occurrence/get?key=323464305
"National Institute of Genetics, ROIS","Herbarium Specimens of Museum of Nature and Human Activities, Hyogo Pref., Japan",,,,,,,HYO,VP,C1-132013,Specimen,,18:54.0,,,Cardamine fallax,,Cardamine fallax,Plantae,Magnoliophyta,,,Cruciferae,Cardamine,Japan,Japan,"Hyogo Pref.; Mihara-gun, Seidan-cho, Matsuho",,,Hyogo,Eastern Asia,Japan,135.217,34.9667,,,,,,,360,360,,http://data.gbif.org/occurrences/323462788,http://data.gbif.org/ws/rest/occurrence/get?key=323462788
"National Institute of Genetics, ROIS","Herbarium Specimens of Museum of Nature and Human Activities, Hyogo Pref., Japan",,,,,,,HYO,VP,C1-165440,Specimen,,18:21.0,,,Cardamine fallax,,Cardamine fallax,Plantae,Magnoliophyta,,,Cruciferae,Cardamine,Japan,Japan,"Hyogo Pref.; Kobe-shi, Nishi-ku, Koumi Sin-ike.",,,Hyogo,Eastern Asia,Japan,135.083,34.7333,,,,,,,,,,http://data.gbif.org/occurrences/323456714,http://data.gbif.org/ws/rest/occurrence/get?key=323456714
"National Institute of Genetics, ROIS","Herbarium Specimens of Museum of Nature and Human Activities, Hyogo Pref., Japan",,,,,,,HYO,VP,C1-145012,Specimen,,21:45.0,,,Cardamine fallax,,Cardamine fallax,Plantae,Magnoliophyta,,,Cruciferae,Cardamine,Japan,Japan,"Hyogo Pref.; Taki-gun, Sasayama-cho, Koganega-take.",,,Hyogo,Eastern Asia,Japan,135.267,35.1167,,,,,,,500,500,,http://data.gbif.org/occurrences/323493354,http://data.gbif.org/ws/rest/occurrence/get?key=323493354
"National Institute of Genetics, ROIS","Herbarium Specimens of Museum of Nature and Human Activities, Hyogo Pref., Japan",,,,,,,HYO,VP,C1-151909,Specimen,,19:08.0,,,Cardamine fallax,,Cardamine fallax,Plantae,Magnoliophyta,,,Cruciferae,Cardamine,Japan,Japan,"Hyogo Pref.; Mihara-gun, Seidan-cho, Matsuho",,,Hyogo,Eastern Asia,Japan,135.2,34.8667,,,,,,,,,,http://data.gbif.org/occurrences/323465245,http://data.gbif.org/ws/rest/occurrence/get?key=323465245
"National Institute of Genetics, ROIS","Herbarium Specimens of Museum of Nature and Human Activities, Hyogo Pref., Japan",,,,,,,HYO,VP,C1-160180,Specimen,,21:22.0,,,Cardamine fallax,,Cardamine fallax,Plantae,Magnoliophyta,,,Cruciferae,Cardamine,Japan,Japan,"Hyogo Pref.; Nishinomiya-shi, Shiose-cho-namaze to Takedao.",,,Hyogo,Eastern Asia,Japan,135.317,34.8167,,,,,,,,,,http://data.gbif.org/occurrences/323488775,http://data.gbif.org/ws/rest/occurrence/get?key=323488775
"National Institute of Genetics, ROIS","Herbarium Specimens of Museum of Nature and Human Activities, Hyogo Pref., Japan",,,,,,,HYO,VP,C1-118077,Specimen,,17:44.0,T.Kobayashi,,Cardamine fallax,,Cardamine fallax,Plantae,Magnoliophyta,,,Cruciferae,Cardamine,Japan,Japan,"Hyogo Pref.; Kobe-shi, Higashinada-ku, Motoyama-machi.",,,Hyogo,Eastern Asia,Japan,135.267,34.7333,,,,,,,300,400,,http://data.gbif.org/occurrences/323449902,http://data.gbif.org/ws/rest/occurrence/get?key=323449902
"National Institute of Genetics, ROIS","Herbarium Specimens of Museum of Nature and Human Activities, Hyogo Pref., Japan",,,,,,,HYO,VP,C1-125635,Specimen,,25:12.0,,,Cardamine fallax,,Cardamine fallax,Plantae,Magnoliophyta,,,Cruciferae,Cardamine,Japan,Japan,"Hyogo Pref.; Takarazuka-shi, Takedao.",,,Hyogo,Eastern Asia,Japan,135.3,34.85,,,,,,,100,200,,http://data.gbif.org/occurrences/323515058,http://data.gbif.org/ws/rest/occurrence/get?key=323515058
"National Institute of Genetics, ROIS","Herbarium Specimens of Museum of Nature and Human Activities, Hyogo Pref., Japan",,,,,,,HYO,VP,C1-115066,Specimen,,19:03.0,,,Cardamine fallax,,Cardamine fallax,Plantae,Magnoliophyta,,,Cruciferae,Cardamine,Japan,Japan,"Hyogo Pref.; Mihara-gun, Seidan-cho, Matsuho",,,Hyogo,Eastern Asia,Japan,135.267,34.9667,,,,,,,220,220,,http://data.gbif.org/occurrences/323464302,http://data.gbif.org/ws/rest/occurrence/get?key=323464302
"National Institute of Genetics, ROIS","Herbarium Specimens of Museum of Nature and Human Activities, Hyogo Pref., Japan",,,,,,,HYO,VP,C1-007029,Specimen,,24:50.0,,,Cardamine fallax,,Cardamine fallax,Plantae,Magnoliophyta,,,Cruciferae,Cardamine,Japan,Japan,"Hyogo Pref.; Mikata-gun, Hamasaka-cho, Sakai.",,,Hyogo,Eastern Asia,Japan,,,,,,,,,,,,http://data.gbif.org/occurrences/323512890,http://data.gbif.org/ws/rest/occurrence/get?key=323512890
"National Institute of Genetics, ROIS","Herbarium Specimens of Museum of Nature and Human Activities, Hyogo Pref., Japan",,,,,,,HYO,VP,C1-006063,Specimen,,21:27.0,,,Cardamine fallax,,Cardamine fallax,Plantae,Magnoliophyta,,,Cruciferae,Cardamine,Japan,Japan,"Hyogo Pref.; Oya, Yachiyo-cho, Taka-gun.",,,Hyogo,Eastern Asia,Japan,,,,,,,,,,,,http://data.gbif.org/occurrences/323489870,http://data.gbif.org/ws/rest/occurrence/get?key=323489870
"National Institute of Genetics, ROIS","Herbarium Specimens of Museum of Nature and Human Activities, Hyogo Pref., Japan",,,,,,,HYO,VP,C1-160182,Specimen,,21:22.0,,,Cardamine fallax,,Cardamine fallax,Plantae,Magnoliophyta,,,Cruciferae,Cardamine,Japan,Japan,"Hyogo Pref.; Nishinomiya-shi, Shiose-cho-namaze to Takedao.",,,Hyogo,Eastern Asia,Japan,135.317,34.8167,,,,,,,,,,http://data.gbif.org/occurrences/323488779,http://data.gbif.org/ws/rest/occurrence/get?key=323488779
"National Institute of Genetics, ROIS","Herbarium Specimens of Museum of Nature and Human Activities, Hyogo Pref., Japan",,,,,,,HYO,VP,C1-160181,Specimen,,21:22.0,,,Cardamine fallax,,Cardamine fallax,Plantae,Magnoliophyta,,,Cruciferae,Cardamine,Japan,Japan,"Hyogo Pref.; Nishinomiya-shi, Shiose-cho-namaze to Takedao.",,,Hyogo,Eastern Asia,Japan,135.317,34.8167,,,,,,,,,,http://data.gbif.org/occurrences/323488777,http://data.gbif.org/ws/rest/occurrence/get?key=323488777
"National Institute of Genetics, ROIS","Herbarium Specimens of Museum of Nature and Human Activities, Hyogo Pref., Japan",,,,,,,HYO,VP,C1-124554,Specimen,,17:53.0,,,Cardamine fallax,,Cardamine fallax,Plantae,Magnoliophyta,,,Cruciferae,Cardamine,Japan,Japan,"Hyogo Pref.; Kobe-shi, Kita-ku, Arino-cho-karato.",,,Hyogo,Eastern Asia,Japan,135.217,34.7833,,,,,,,300,320,,http://data.gbif.org/occurrences/323451446,http://data.gbif.org/ws/rest/occurrence/get?key=323451446
"National Institute of Genetics, ROIS","Herbarium Specimens of Museum of Nature and Human Activities, Hyogo Pref., Japan",,,,,,,HYO,VP,C1-160177,Specimen,,21:22.0,,,Cardamine fallax,,Cardamine fallax,Plantae,Magnoliophyta,,,Cruciferae,Cardamine,Japan,Japan,"Hyogo Pref.; Nishinomiya-shi, Shiose-cho-namaze to Takedao.",,,Hyogo,Eastern Asia,Japan,135.317,34.8167,,,,,,,,,,http://data.gbif.org/occurrences/323488767,http://data.gbif.org/ws/rest/occurrence/get?key=323488767
"National Institute of Genetics, ROIS","Herbarium Specimens of Museum of Nature and Human Activities, Hyogo Pref., Japan",,,,,,,HYO,VP,C1-117674,Specimen,,21:14.0,T.Kobayashi,,Cardamine fallax,,Cardamine fallax,Plantae,Magnoliophyta,,,Cruciferae,Cardamine,Japan,Japan,"Hyogo Pref.; Nishinomiya-shi, Shiose-cho-najio.",,,Hyogo,Eastern Asia,Japan,135.317,34.8333,,,,,,,100,300,,http://data.gbif.org/occurrences/323487383,http://data.gbif.org/ws/rest/occurrence/get?key=323487383
"National Institute of Genetics, ROIS","Herbarium Specimens of Museum of Nature and Human Activities, Hyogo Pref., Japan",,,,,,,HYO,VP,C1-165215,Specimen,,19:29.0,,,Cardamine fallax,,Cardamine fallax,Plantae,Magnoliophyta,,,Cruciferae,Cardamine,Japan,Japan,"Hyogo Pref.; Mihara-gun, Seidan-cho, Matsuho",,,Hyogo,Eastern Asia,Japan,134.65,35.0667,,,,,,,,,,http://data.gbif.org/occurrences/323468683,http://data.gbif.org/ws/rest/occurrence/get?key=323468683
"National Institute of Genetics, ROIS","Herbarium Specimens of Museum of Nature and Human Activities, Hyogo Pref., Japan",,,,,,,HYO,VP,C1-131405,Specimen,,22:08.0,T.Suzuki,,Cardamine fallax,,Cardamine fallax,Plantae,Magnoliophyta,,,Cruciferae,Cardamine,Japan,Japan,"KINKI:HYOGO Pref., Kawanishi City, Yamahara, alt.100-150m",,,Hyogo,Eastern Asia,Japan,135.4,34.9,,,,,,,,,,http://data.gbif.org/occurrences/323497649,http://data.gbif.org/ws/rest/occurrence/get?key=323497649
"National Institute of Genetics, ROIS","Herbarium Specimens of Museum of Nature and Human Activities, Hyogo Pref., Japan",,,,,,,HYO,VP,C1-121522,Specimen,,16:59.0,,,Cardamine fallax,,Cardamine fallax,Plantae,Magnoliophyta,,,Cruciferae,Cardamine,Japan,Japan,"Hyogo Pref.; Akoh-shi, Minaminonaka.",,,Hyogo,Eastern Asia,Japan,134.4,34.75,,,,,,,1,1,,http://data.gbif.org/occurrences/323439553,http://data.gbif.org/ws/rest/occurrence/get?key=323439553
"National Institute of Genetics, ROIS","Herbarium Specimens of Museum of Nature and Human Activities, Hyogo Pref., Japan",,,,,,,HYO,VP,C1-106134,Specimen,,19:50.0,,,Cardamine fallax,,Cardamine fallax,Plantae,Magnoliophyta,,,Cruciferae,Cardamine,Japan,Japan,"Hyogo Pref.; Mihara-gun, Seidan-cho, Matsuho",,,Hyogo,Eastern Asia,Japan,134.517,35.1667,,,,,,,300,400,,http://data.gbif.org/occurrences/323472395,http://data.gbif.org/ws/rest/occurrence/get?key=323472395
"National Institute of Genetics, ROIS","Herbarium Specimens of Museum of Nature and Human Activities, Hyogo Pref., Japan",,,,,,,HYO,VP,C1-117641,Specimen,,22:23.0,T.Kobayashi,,Cardamine fallax,,Cardamine fallax,Plantae,Magnoliophyta,,,Cruciferae,Cardamine,Japan,Japan,"Pref.Hyogo: Momiji-dani. Kita-Rokko-san,  Kobe-shi.",,,Hyogo,Eastern Asia,Japan,135.217,34.7667,,,,,,,500,700,,http://data.gbif.org/occurrences/323499716,http://data.gbif.org/ws/rest/occurrence/get?key=323499716
"National Institute of Genetics, ROIS","Herbarium Specimens of Museum of Nature and Human Activities, Hyogo Pref., Japan",,,,,,,SAN,VP,C1-110057,Specimen,,20:45.0,,,Cardamine fallax,,Cardamine fallax,Plantae,Magnoliophyta,,,Cruciferae,Cardamine,Japan,Japan,"Hyogo Pref.; Mihara-gun, Seidan-cho, Matsuho",,,Hyogo,Eastern Asia,Japan,134.683,35.0167,,,,,,,150,160,,http://data.gbif.org/occurrences/323482318,http://data.gbif.org/ws/rest/occurrence/get?key=323482318
"National Institute of Genetics, ROIS","Herbarium Specimens of Museum of Nature and Human Activities, Hyogo Pref., Japan",,,,,,,HYO,VP,C1-122270,Specimen,,17:29.0,,,Cardamine fallax,,Cardamine fallax,Plantae,Magnoliophyta,,,Cruciferae,Cardamine,Japan,Japan,"Hyogo Pref.; Kasai-shi, Kamimanganji-cho.",,,Hyogo,Eastern Asia,Japan,134.85,35,,,,,,,200,200,,http://data.gbif.org/occurrences/323446535,http://data.gbif.org/ws/rest/occurrence/get?key=323446535
"National Institute of Genetics, ROIS","Herbarium Specimens of Museum of Nature and Human Activities, Hyogo Pref., Japan",,,,,,,HYO,VP,C1-106163,Specimen,,19:50.0,,,Cardamine fallax,,Cardamine fallax,Plantae,Magnoliophyta,,,Cruciferae,Cardamine,Japan,Japan,"Hyogo Pref.; Mihara-gun, Seidan-cho, Matsuho",,,Hyogo,Eastern Asia,Japan,134.517,35.1667,,,,,,,300,400,,http://data.gbif.org/occurrences/323472399,http://data.gbif.org/ws/rest/occurrence/get?key=323472399
"National Institute of Genetics, ROIS","Herbarium Specimens of Museum of Nature and Human Activities, Hyogo Pref., Japan",,,,,,,HYO,VP,C1-115056,Specimen,,19:30.0,,,Cardamine fallax,,Cardamine fallax,Plantae,Magnoliophyta,,,Cruciferae,Cardamine,Japan,Japan,"Hyogo Pref.; Mihara-gun, Seidan-cho, Matsuho",,,Hyogo,Eastern Asia,Japan,134.667,35.2,,,,,,,,,,http://data.gbif.org/occurrences/323468877,http://data.gbif.org/ws/rest/occurrence/get?key=323468877
"National Institute of Genetics, ROIS","Herbarium Specimens of Museum of Nature and Human Activities, Hyogo Pref., Japan",,,,,,,HYO,VP,C1-132589,Specimen,,18:17.0,,,Cardamine fallax,,Cardamine fallax,Plantae,Magnoliophyta,,,Cruciferae,Cardamine,Japan,Japan,"Hyogo Pref.; Kobe-shi, Nada-ku, Rokko-san, Suisyou-dani.",,,Hyogo,Eastern Asia,Japan,135.25,34.7667,,,,,,,400,400,,http://data.gbif.org/occurrences/323455962,http://data.gbif.org/ws/rest/occurrence/get?key=323455962
"National Institute of Genetics, ROIS","Herbarium Specimens of Museum of Nature and Human Activities, Hyogo Pref., Japan",,,,,,,HYO,VP,C1-160178,Specimen,,21:22.0,,,Cardamine fallax,,Cardamine fallax,Plantae,Magnoliophyta,,,Cruciferae,Cardamine,Japan,Japan,"Hyogo Pref.; Nishinomiya-shi, Shiose-cho-namaze to Takedao.",,,Hyogo,Eastern Asia,Japan,135.317,34.8167,,,,,,,,,,http://data.gbif.org/occurrences/323488770,http://data.gbif.org/ws/rest/occurrence/get?key=323488770
"National Museum of Nature and Science, Japan",Angiosperm specimens of Iwate Prefectural Museum,,,,,,,IPMM,PA,70861,Specimen,,59:28.0,,,Cardamine fallax (O.E.Schulz) Nakai,(O.E.Schulz) Nakai,Cardamine fallax (O.E.Schulz) Nakai,Plantae,Angiospermae,Dicotyledoneae,,Cruciferae,Cardamine,Japan,Japan,,Tono-shi,,Iwate,Eastern Asia,Japan,,,,,,,,,,,,http://data.gbif.org/occurrences/93882054,http://data.gbif.org/ws/rest/occurrence/get?key=93882054
"National Museum of Nature and Science, Japan",Angiosperm specimens of Iwate Prefectural Museum,,,,,,,IPMM,PA,70865,Specimen,,59:28.0,,,Cardamine fallax (O.E.Schulz) Nakai,(O.E.Schulz) Nakai,Cardamine fallax (O.E.Schulz) Nakai,Plantae,Angiospermae,Dicotyledoneae,,Cruciferae,Cardamine,Japan,Japan,,Shimohei-gun Yamadamachi,,Iwate,Eastern Asia,Japan,,,,,,,,,,,,http://data.gbif.org/occurrences/93882055,http://data.gbif.org/ws/rest/occurrence/get?key=93882055
"National Museum of Nature and Science, Japan",Angiosperm specimens of Iwate Prefectural Museum,,,,,,,IPMM,PA,119199,Specimen,,59:32.0,,,Cardamine fallax (O.E.Schulz) Nakai,(O.E.Schulz) Nakai,Cardamine fallax (O.E.Schulz) Nakai,Plantae,Angiospermae,Dicotyledoneae,Papaverales,Cruciferae,Cardamine,Japan,Japan,,Tono-shi,,Iwate,Eastern Asia,Japan,,,,,,,,,,,,http://data.gbif.org/occurrences/204232168,http://data.gbif.org/ws/rest/occurrence/get?key=204232168
"National Museum of Nature and Science, Japan",Angiosperm specimens of Iwate Prefectural Museum,,,,,,,IPMM,PA,70862,Specimen,,59:28.0,,,Cardamine fallax (O.E.Schulz) Nakai,(O.E.Schulz) Nakai,Cardamine fallax (O.E.Schulz) Nakai,Plantae,Angiospermae,Dicotyledoneae,,Cruciferae,Cardamine,Japan,Japan,,Kamihei-gun Otsuchicho,,Iwate,Eastern Asia,Japan,,,,,,,,,,,,http://data.gbif.org/occurrences/93882060,http://data.gbif.org/ws/rest/occurrence/get?key=93882060
"National Museum of Nature and Science, Japan",Angiosperm specimens of Iwate Prefectural Museum,,,,,,,IPMM,PA,4730,Specimen,,59:29.0,,,Cardamine fallax (O.E.Schulz) Nakai,(O.E.Schulz) Nakai,Cardamine fallax (O.E.Schulz) Nakai,Plantae,Angiospermae,Dicotyledoneae,Papaverales,Cruciferae,Cardamine,Japan,Japan,,Tono-shi,,Iwate,Eastern Asia,Japan,,,,,,,,,,,,http://data.gbif.org/occurrences/204231619,http://data.gbif.org/ws/rest/occurrence/get?key=204231619
"National Museum of Nature and Science, Japan","Gunma Museum of Natural History, Vascular Plant Specimen",,,,,,,GMNHJ,plant,BS0006972,Specimen,,34:20.0,,,Cardamine fallax (O.E.Schulz) Nakai,,Cardamine fallax (O.E.Schulz) Nakai,Plantae,Spermatophyta,,,Cruciferae,Cardamine,Japan,Japan,"Oshiozawa,Shimotakahara",Kanra-gun Nanmokumura,,Gunma,Eastern Asia,Japan,36.2028,138.712,,45678,27,,,,520,,,http://data.gbif.org/occurrences/188201058,http://data.gbif.org/ws/rest/occurrence/get?key=188201058
"National Museum of Nature and Science, Japan","Gunma Museum of Natural History, Vascular Plant Specimen",,,,,,,GMNHJ,plant,BS0086212,Specimen,,34:21.0,,,Cardamine fallax (O.E.Schulz) Nakai,,Cardamine fallax (O.E.Schulz) Nakai,Plantae,Spermatophyta,,,Cruciferae,Cardamine,Japan,Japan,Todahara,Toda-shi,,Saitama,Eastern Asia,Japan,35.8024,139.67,,45319,86,,,,,,,http://data.gbif.org/occurrences/188201941,http://data.gbif.org/ws/rest/occurrence/get?key=188201941
"National Museum of Nature and Science, Japan","FKSE-Herbarium specimens of Faculty of Symbiotic Systems Science, Fukushima University, Japan",,,,,,,FKSE,Plant,18417,Specimen,,51:08.0,,,Cardamine fallax (O.E.Schulz) Nakai,(O.E.Schulz) Nakai,Cardamine fallax (O.E.Schulz) Nakai,Plantae,,,,BRASSICACEAE,Cardamine,Japan,Japan,Mt. Akai-dake.,Iwaki-shi,,Fukushima,Eastern Asia,Japan,,,,,,,,,100,605,,http://data.gbif.org/occurrences/391287344,http://data.gbif.org/ws/rest/occurrence/get?key=391287344
"National Museum of Nature and Science, Japan","FKSE-Herbarium specimens of Faculty of Symbiotic Systems Science, Fukushima University, Japan",,,,,,,FKSE,Plant,12027,Specimen,,51:05.0,,,Cardamine fallax (O.E.Schulz) Nakai,(O.E.Schulz) Nakai,Cardamine fallax (O.E.Schulz) Nakai,Plantae,,,,BRASSICACEAE,Cardamine,Japan,Japan,"Honshu, Tohoku Distr., Fukushima Pref., Sohma-shi, Matsukawa-ura, Unoo-misaki,",,,,Eastern Asia,Japan,37.8167,140.983,,46040,89,,,,4,10,,http://data.gbif.org/occurrences/238088882,http://data.gbif.org/ws/rest/occurrence/get?key=238088882
"National Museum of Nature and Science, Japan","Herbarium Specimens of Tokushima Prefectural Museum, Japan",,,,,,,TKPM,B,SP141297,Specimen,,22:04.0,,,Cardamine fallax (O.E.Schulz) Nakai,(O.E.Schulz) Nakai,Cardamine fallax (O.E.Schulz) Nakai,Plantae,Angiospermae,Dicotyledoneae,Angiospermae,Cruciferae,Cardamine,Japan,Japan,,Naruto City,,Tokushima Pref.,Eastern Asia,Japan,,,,,,,,,,,,http://data.gbif.org/occurrences/150127218,http://data.gbif.org/ws/rest/occurrence/get?key=150127218
"National Museum of Nature and Science, Japan","Herbarium Specimens of Tokushima Prefectural Museum, Japan",,,,,,,TKPM,B,SP007252,Specimen,,22:01.0,,,Cardamine fallax (O.E.Schulz) Nakai,(O.E.Schulz) Nakai,Cardamine fallax (O.E.Schulz) Nakai,Plantae,Angiospermae,Dicotyledoneae,Angiospermae,Cruciferae,Cardamine,Japan,Japan,,Mima-cho,,Tokushima Pref.,Eastern Asia,Japan,,,,,,,,,,,,http://data.gbif.org/occurrences/150126931,http://data.gbif.org/ws/rest/occurrence/get?key=150126931
"National Museum of Nature and Science, Japan",Kochi Prefectural Makino Botanical Garden,,,,,,,MBK,MBK,6488,Specimen,,02:58.0,,,Cardamine fallax (O.E.Schulz) Nakai,,Cardamine fallax (O.E.Schulz) Nakai,Plantae,,,Papaverales,Cruciferae,Cardamine,Japan,Japan,,Agawa Village,,Pref. Kochi,Eastern Asia,Japan,33.5458,133.106,,44593,51,,,,,,,http://data.gbif.org/occurrences/143959521,http://data.gbif.org/ws/rest/occurrence/get?key=143959521
"National Museum of Nature and Science, Japan",Vascular Plants Collection of Sagamihara City Museum,,,,,,,JSCM,VS,33806,Specimen,,42:18.0,,,Cardamine fallax (O.E.Schulz) Nakai,(O.E.Schulz) Nakai,Cardamine fallax (O.E.Schulz) Nakai,Plantae,Spermatophyta,,,CRUCIFERAE,Cardamine,Japan,Japan,"Toya, Tsukui Town, Sagamihara City, Kanagawa Pref.",Sagamihara-shi,,Kanagawa,Eastern Asia,Japan,,,,,,,,,380,,,http://data.gbif.org/occurrences/387666691,http://data.gbif.org/ws/rest/occurrence/get?key=387666691