Data Publisher,Dataset,Dataset Rights,Collector name,Collector number,Field number,GUID,Date collected,Institution code,Collection code,Catalogue number,Basis of record,Image url,Last indexed,Identifier,Identification date,Scientific name,Author,Scientific name (interpreted),Kingdom,Phylum,Class,Order,Family,Genus,Country,Country (interpreted),Locality,County,Continent or Ocean,State/Province,Region,Publisher country,Latitude,Longitude,Coordinate precision,Cell id,Centi cell id,Min depth,Max depth,Max depth,Min altitude,Max altitude,Altitude precision,GBIF portal url,GBIF webservice url
"National Institute of Genetics, ROIS","Herbarium Specimens of Museum of Nature and Human Activities, Hyogo Pref., Japan",,,,,,,HYO,VP,C1-052666,Specimen,,20:38.0,,,Phaenosperma globosum,,Phaenosperma globosum,Plantae,Magnoliophyta,,,Gramineae,Phaenosperma,Japan,Japan,"Hyogo Pref.; Mihara-gun, Seidan-cho, Matsuho",,,Hyogo,Eastern Asia,Japan,134.533,34.6667,,,,,,,0,50,,http://data.gbif.org/occurrences/323481077,http://data.gbif.org/ws/rest/occurrence/get?key=323481077
"National Institute of Genetics, ROIS","Herbarium Specimens of Museum of Nature and Human Activities, Hyogo Pref., Japan",,,,,,,HYO,VP,C1-052525,Specimen,,20:38.0,,,Phaenosperma globosum,,Phaenosperma globosum,Plantae,Magnoliophyta,,,Gramineae,Phaenosperma,Japan,Japan,"Hyogo Pref.; Mihara-gun, Seidan-cho, Matsuho",,,Hyogo,Eastern Asia,Japan,134.533,34.6667,,,,,,,0,10,,http://data.gbif.org/occurrences/323480987,http://data.gbif.org/ws/rest/occurrence/get?key=323480987
"National Institute of Genetics, ROIS","Herbarium Specimens of Museum of Nature and Human Activities, Hyogo Pref., Japan",,,,,,,HYO,VP,C1-134173,Specimen,,20:32.0,Y.Fujimoto,,Phaenosperma globosum,,Phaenosperma globosum,Plantae,Magnoliophyta,,,Gramineae,Phaenosperma,Japan,Japan,"Hyogo Pref.; Mihara-gun, Seidan-cho, Matsuho",,,Hyogo,Eastern Asia,Japan,134.433,34.65,,,,,,,0,70,,http://data.gbif.org/occurrences/323479948,http://data.gbif.org/ws/rest/occurrence/get?key=323479948
"National Institute of Genetics, ROIS","Herbarium Specimens of Museum of Nature and Human Activities, Hyogo Pref., Japan",,,,,,,HYO,VP,C1-053375,Specimen,,20:37.0,,,Phaenosperma globosum,,Phaenosperma globosum,Plantae,Magnoliophyta,,,Gramineae,Phaenosperma,Japan,Japan,"Hyogo Pref.; Mihara-gun, Seidan-cho, Matsuho",,,Hyogo,Eastern Asia,Japan,134.533,34.6667,,,,,,,0,10,,http://data.gbif.org/occurrences/323480873,http://data.gbif.org/ws/rest/occurrence/get?key=323480873
"National Institute of Genetics, ROIS","Herbarium Specimens of Museum of Nature and Human Activities, Hyogo Pref., Japan",,,,,,,HYO,VP,C1-155331,Specimen,,21:52.0,,,Phaenosperma globosum,,Phaenosperma globosum,Plantae,Magnoliophyta,,,Gramineae,Phaenosperma,Japan,Japan,"Hyogo Pref.; Tsuna-gun, Hokudan-cho, Nojimatodoroki.",,,Hyogo,Eastern Asia,Japan,134.967,34.5667,,,,,,,0,50,,http://data.gbif.org/occurrences/323494747,http://data.gbif.org/ws/rest/occurrence/get?key=323494747
"National Institute of Genetics, ROIS","Herbarium Specimens of Museum of Nature and Human Activities, Hyogo Pref., Japan",,,,,,,HYO,VP,C1-105361,Specimen,,20:40.0,,,Phaenosperma globosum,,Phaenosperma globosum,Plantae,Magnoliophyta,,,Gramineae,Phaenosperma,Japan,Japan,"Hyogo Pref.; Mihara-gun, Seidan-cho, Matsuho",,,Hyogo,Eastern Asia,Japan,134.517,34.6333,,,,,,,,,,http://data.gbif.org/occurrences/323481478,http://data.gbif.org/ws/rest/occurrence/get?key=323481478
"National Institute of Genetics, ROIS","Herbarium Specimens of Museum of Nature and Human Activities, Hyogo Pref., Japan",,,,,,,HYO,VP,C1-177099,Specimen,,20:35.0,Tak.Shimizu,,Phaenosperma globosum,,Phaenosperma globosum,Plantae,Magnoliophyta,,,Gramineae,Phaenosperma,Japan,Japan,"Hyogo Pref.; Mihara-gun, Seidan-cho, Matsuho",,,Hyogo,Eastern Asia,Japan,134.533,34.6667,,,,,,,5,50,,http://data.gbif.org/occurrences/323480453,http://data.gbif.org/ws/rest/occurrence/get?key=323480453
"National Institute of Genetics, ROIS","Herbarium Specimens of Museum of Nature and Human Activities, Hyogo Pref., Japan",,,,,,,HYO,VP,C1-052547,Specimen,,20:37.0,,,Phaenosperma globosum,,Phaenosperma globosum,Plantae,Magnoliophyta,,,Gramineae,Phaenosperma,Japan,Japan,"Hyogo Pref.; Mihara-gun, Seidan-cho, Matsuho",,,Hyogo,Eastern Asia,Japan,134.533,34.6667,,,,,,,0,100,,http://data.gbif.org/occurrences/323480797,http://data.gbif.org/ws/rest/occurrence/get?key=323480797
"National Institute of Genetics, ROIS","Herbarium Specimens of Museum of Nature and Human Activities, Hyogo Pref., Japan",,,,,,,HYO,VP,C1-033844,Specimen,,18:33.0,,,Phaenosperma globosum,,Phaenosperma globosum,Plantae,Magnoliophyta,,,Gramineae,Phaenosperma,Japan,Japan,"Hyogo Pref.; Mihara-gun, Seidan-cho, Matsuho",,,Hyogo,Eastern Asia,Japan,134.833,34.1667,,,,,,,0,120,,http://data.gbif.org/occurrences/323459125,http://data.gbif.org/ws/rest/occurrence/get?key=323459125
"National Institute of Genetics, ROIS","Herbarium Specimens of Museum of Nature and Human Activities, Hyogo Pref., Japan",,,,,,,HYO,VP,C1-026641,Specimen,,21:53.0,,,Phaenosperma globosum,,Phaenosperma globosum,Plantae,Magnoliophyta,,,Gramineae,Phaenosperma,Japan,Japan,"Hyogo Pref.; Tsuna-gun, Hokudan-cho, Todoroki",,,Hyogo,Eastern Asia,Japan,134.967,34.5667,,,,,,,50,200,,http://data.gbif.org/occurrences/323494826,http://data.gbif.org/ws/rest/occurrence/get?key=323494826
"National Museum of Nature and Science, Japan","Plant specimens depodited in Osaka Museum of Natural History, Japan.",,,,,,,OSA,C,OSA68916,Specimen,,21:50.0,,,Phaenosperma globosum Makino,,Phaenosperma globosum Makino,Plantae,,,,Poaceae,Phaenosperma,Japan,Japan,,Wakayama-shi,,Wakayama,Eastern Asia,Japan,,,,,,,,,,,,http://data.gbif.org/occurrences/295153791,http://data.gbif.org/ws/rest/occurrence/get?key=295153791
"National Museum of Nature and Science, Japan","Herbarium Specimens of Museum of Nature and Human Activities, Hyogo Prefecture, Japan",,,,,,,HYO,HYO-C,C1-177271,Specimen,,27:48.0,,,Phaenosperma globosum Munro,Munro,Phaenosperma globosum Munro,Plantae,,,,Gramineae,Phaenosperma,Japan,Japan,,,,Hyogo,Eastern Asia,Japan,,,,,,,,,,25,,http://data.gbif.org/occurrences/177372988,http://data.gbif.org/ws/rest/occurrence/get?key=177372988
"National Museum of Nature and Science, Japan","Herbarium Specimens of Museum of Nature and Human Activities, Hyogo Prefecture, Japan",,,,,,,HYO,HYO-C,C1-177256,Specimen,,27:48.0,,,Phaenosperma globosum Munro,Munro,Phaenosperma globosum Munro,Plantae,,,,Gramineae,Phaenosperma,Japan,Japan,,,,Hyogo,Eastern Asia,Japan,,,,,,,,,,35,,http://data.gbif.org/occurrences/177372987,http://data.gbif.org/ws/rest/occurrence/get?key=177372987
"National Museum of Nature and Science, Japan","Herbarium Specimens of Museum of Nature and Human Activities, Hyogo Prefecture, Japan",,,,,,,HYO,HYO-C,C1-177504,Specimen,,27:48.0,,,Phaenosperma globosum Munro,Munro,Phaenosperma globosum Munro,Plantae,,,,Gramineae,Phaenosperma,Japan,Japan,,,,Okayama,Eastern Asia,Japan,,,,,,,,,,,,http://data.gbif.org/occurrences/177372989,http://data.gbif.org/ws/rest/occurrence/get?key=177372989
"National Museum of Nature and Science, Japan","Ibaraki Nature Museum, Vascular Plants collection",,,,,,,INM,Va,42604,Specimen,,53:04.0,,,Phaenosperma globosum Munro,Munro,Phaenosperma globosum Munro,Plantae,ANGIOSPERMAE,MONOCOTYLEDONEAE,,POACEAE,Phaenosperma,Japan,Japan,,,,,Eastern Asia,Japan,,,,,,,,,,,,http://data.gbif.org/occurrences/381829383,http://data.gbif.org/ws/rest/occurrence/get?key=381829383
"National Museum of Nature and Science, Japan",Plant Specimens of Kurashiki Museum of Natural History,,,,,,,KURA,KURA,159137,Specimen,,16:58.0,,,Phaenosperma globosum Munro,,Phaenosperma globosum Munro,Plantae,,,Graminales,Gramineae,Phaenosperma,Japan,Japan,Miyaura,Okayama City,,Okayama Prefecture,Eastern Asia,Japan,,,,,,,,,,,,http://data.gbif.org/occurrences/148844780,http://data.gbif.org/ws/rest/occurrence/get?key=148844780
"National Museum of Nature and Science, Japan",Plant Specimens of Kurashiki Museum of Natural History,,,,,,,KURA,KURA,59449,Specimen,,16:58.0,,,Phaenosperma globosum Munro,,Phaenosperma globosum Munro,Plantae,,,Graminales,Gramineae,Phaenosperma,Japan,Japan,Miyaura,Okayama City,,Okayama Prefecture,Eastern Asia,Japan,,,,,,,,,,,,http://data.gbif.org/occurrences/148844688,http://data.gbif.org/ws/rest/occurrence/get?key=148844688
"National Museum of Nature and Science, Japan",Plant Specimens of Kurashiki Museum of Natural History,,,,,,,KURA,KURA,kt99060,Specimen,,16:59.0,,,Phaenosperma globosum Munro,Munro,Phaenosperma globosum Munro,Plantae,,,Graminales,Gramineae,Phaenosperma,Japan,Japan,,Bitchu-cho,,Okayama,Eastern Asia,Japan,,,,,,,,,,,,http://data.gbif.org/occurrences/204284371,http://data.gbif.org/ws/rest/occurrence/get?key=204284371
"National Museum of Nature and Science, Japan",Plant Specimens of Kurashiki Museum of Natural History,,,,,,,KURA,KURA,kt101705,Specimen,,16:59.0,,,Phaenosperma globosum Munro,Munro,Phaenosperma globosum Munro,Plantae,,,Graminales,Gramineae,Phaenosperma,Japan,Japan,,Tamano-shi,,Okayama,Eastern Asia,Japan,,,,,,,,,,,,http://data.gbif.org/occurrences/204284170,http://data.gbif.org/ws/rest/occurrence/get?key=204284170
"National Museum of Nature and Science, Japan",Plant Specimens of Kurashiki Museum of Natural History,,,,,,,KURA,KURA,kt28022,Specimen,,17:00.0,,,Phaenosperma globosum Munro,Munro,Phaenosperma globosum Munro,Plantae,,,Graminales,Gramineae,Phaenosperma,Japan,Japan,,Kamogawa-cho,,Okayama,Eastern Asia,Japan,,,,,,,,,,,,http://data.gbif.org/occurrences/204284546,http://data.gbif.org/ws/rest/occurrence/get?key=204284546
"National Museum of Nature and Science, Japan",Plant Specimens of Kurashiki Museum of Natural History,,,,,,,KURA,KURA,3555,Specimen,,17:00.0,,,Phaenosperma globosum Munro,Munro,Phaenosperma globosum Munro,Plantae,,,Graminales,Gramineae,Phaenosperma,Japan,Japan,,Niimi-shi,,Okayama,Eastern Asia,Japan,,,,,,,,,,,,http://data.gbif.org/occurrences/395785195,http://data.gbif.org/ws/rest/occurrence/get?key=395785195
"National Museum of Nature and Science, Japan",Plant Specimens of Kurashiki Museum of Natural History,,,,,,,KURA,KURA,40010,Specimen,,16:58.0,,,Phaenosperma globosum Munro,,Phaenosperma globosum Munro,Plantae,,,Graminales,Gramineae,Phaenosperma,Japan,Japan,Yadu,Okayama City,,Okayama Prefecture,Eastern Asia,Japan,,,,,,,,,,,,http://data.gbif.org/occurrences/148844606,http://data.gbif.org/ws/rest/occurrence/get?key=148844606
"National Museum of Nature and Science, Japan",Plant Specimens of Kurashiki Museum of Natural History,,,,,,,KURA,KURA,kt161660,Specimen,,16:59.0,,,Phaenosperma globosum Munro,Munro,Phaenosperma globosum Munro,Plantae,,,Graminales,Gramineae,Phaenosperma,Japan,Japan,,Setouchi-shi,,Okayama,Eastern Asia,Japan,,,,,,,,,,,,http://data.gbif.org/occurrences/204284425,http://data.gbif.org/ws/rest/occurrence/get?key=204284425
"National Museum of Nature and Science, Japan",Plant Specimens of Kurashiki Museum of Natural History,,,,,,,KURA,KURA,138689,Specimen,,16:58.0,,,Phaenosperma globosum Munro,,Phaenosperma globosum Munro,Plantae,,,Graminales,Gramineae,Phaenosperma,Japan,Japan,Tsurajima-cho,Kurashiki City,,Okayama Prefecture,Eastern Asia,Japan,,,,,,,,,,,,http://data.gbif.org/occurrences/148844534,http://data.gbif.org/ws/rest/occurrence/get?key=148844534
"National Museum of Nature and Science, Japan",Plant Specimens of Kurashiki Museum of Natural History,,,,,,,KURA,KURA,kt126424,Specimen,,16:59.0,,,Phaenosperma globosum Munro,Munro,Phaenosperma globosum Munro,Plantae,,,Graminales,Gramineae,Phaenosperma,Japan,Japan,,Nariwa-cho,,Okayama,Eastern Asia,Japan,,,,,,,,,,,,http://data.gbif.org/occurrences/204284377,http://data.gbif.org/ws/rest/occurrence/get?key=204284377
"National Museum of Nature and Science, Japan",Plant Specimens of Kurashiki Museum of Natural History,,,,,,,KURA,KURA,41564,Specimen,,16:58.0,,,Phaenosperma globosum Munro,,Phaenosperma globosum Munro,Plantae,,,Graminales,Gramineae,Phaenosperma,Japan,Japan,Kamimizushima Isl.,Kurashiki City,,Okayama Prefecture,Eastern Asia,Japan,,,,,,,,,,,,http://data.gbif.org/occurrences/148844457,http://data.gbif.org/ws/rest/occurrence/get?key=148844457
"National Museum of Nature and Science, Japan",Plant Specimens of Kurashiki Museum of Natural History,,,,,,,KURA,KURA,kt159064,Specimen,,16:59.0,,,Phaenosperma globosum Munro,Munro,Phaenosperma globosum Munro,Plantae,,,Graminales,Gramineae,Phaenosperma,Japan,Japan,,Tamano-shi,,Okayama,Eastern Asia,Japan,,,,,,,,,,,,http://data.gbif.org/occurrences/204284181,http://data.gbif.org/ws/rest/occurrence/get?key=204284181
"National Museum of Nature and Science, Japan",Plant Specimens of Kurashiki Museum of Natural History,,,,,,,KURA,KURA,kt149956,Specimen,,17:00.0,,,Phaenosperma globosum Munro,Munro,Phaenosperma globosum Munro,Plantae,,,Graminales,Gramineae,Phaenosperma,Japan,Japan,,Kamogawa-cho,,Okayama,Eastern Asia,Japan,,,,,,,,,,,,http://data.gbif.org/occurrences/204284586,http://data.gbif.org/ws/rest/occurrence/get?key=204284586
"National Museum of Nature and Science, Japan",Plant Specimens of Kurashiki Museum of Natural History,,,,,,,KURA,KURA,kt143480,Specimen,,16:59.0,,,Phaenosperma globosum Munro,Munro,Phaenosperma globosum Munro,Plantae,,,Graminales,Gramineae,Phaenosperma,Japan,Japan,,Tamano-shi,,Okayama,Eastern Asia,Japan,,,,,,,,,,,,http://data.gbif.org/occurrences/204284176,http://data.gbif.org/ws/rest/occurrence/get?key=204284176
"National Museum of Nature and Science, Japan",Plant Specimens of Kurashiki Museum of Natural History,,,,,,,KURA,KURA,kt152957,Specimen,,16:59.0,,,Phaenosperma globosum Munro,Munro,Phaenosperma globosum Munro,Plantae,,,Graminales,Gramineae,Phaenosperma,Japan,Japan,,Setouchi-shi,,Okayama,Eastern Asia,Japan,,,,,,,,,,,,http://data.gbif.org/occurrences/204284415,http://data.gbif.org/ws/rest/occurrence/get?key=204284415
"National Museum of Nature and Science, Japan",Plant Specimens of Kurashiki Museum of Natural History,,,,,,,KURA,KURA,kt149930,Specimen,,17:00.0,,,Phaenosperma globosum Munro,Munro,Phaenosperma globosum Munro,Plantae,,,Graminales,Gramineae,Phaenosperma,Japan,Japan,,Mitsu-cho,,Okayama,Eastern Asia,Japan,,,,,,,,,,,,http://data.gbif.org/occurrences/204284583,http://data.gbif.org/ws/rest/occurrence/get?key=204284583
"National Museum of Nature and Science, Japan",Plant Specimens of Kurashiki Museum of Natural History,,,,,,,KURA,KURA,kt123635,Specimen,,16:59.0,,,Phaenosperma globosum Munro,Munro,Phaenosperma globosum Munro,Plantae,,,Graminales,Gramineae,Phaenosperma,Japan,Japan,,Tamano-shi,,Okayama,Eastern Asia,Japan,,,,,,,,,,,,http://data.gbif.org/occurrences/204284172,http://data.gbif.org/ws/rest/occurrence/get?key=204284172
"National Museum of Nature and Science, Japan",Plant Specimens of Kurashiki Museum of Natural History,,,,,,,KURA,KURA,67530,Specimen,,16:58.0,,,Phaenosperma globosum Munro,,Phaenosperma globosum Munro,Plantae,,,Graminales,Gramineae,Phaenosperma,Japan,Japan,Miyaura,Okayama City,,Okayama Prefecture,Eastern Asia,Japan,,,,,,,,,,,,http://data.gbif.org/occurrences/148844715,http://data.gbif.org/ws/rest/occurrence/get?key=148844715
"National Museum of Nature and Science, Japan",Plant Specimens of Kurashiki Museum of Natural History,,,,,,,KURA,KURA,kt153567,Specimen,,16:59.0,,,Phaenosperma globosum Munro,Munro,Phaenosperma globosum Munro,Plantae,,,Graminales,Gramineae,Phaenosperma,Japan,Japan,,Setouchi-shi,,Okayama,Eastern Asia,Japan,,,,,,,,,,,,http://data.gbif.org/occurrences/204284416,http://data.gbif.org/ws/rest/occurrence/get?key=204284416
"National Museum of Nature and Science, Japan","Plant specimens depodited in Osaka Museum of Natural History, Japan.",,,,,,,OSA,C,OSA8909,Specimen,,21:48.0,,,Phaenosperma globosum Munro,Munro,Phaenosperma globosum Munro,Plantae,,,,Poaceae,Phaenosperma,Japan,Japan,,Obama-shi,,Fukui Prefecture,Eastern Asia,Japan,,,,,,,,,,,,http://data.gbif.org/occurrences/295153439,http://data.gbif.org/ws/rest/occurrence/get?key=295153439
"National Museum of Nature and Science, Japan","Plant specimens depodited in Osaka Museum of Natural History, Japan.",,,,,,,OSA,C,OSA9890,Specimen,,21:48.0,,,Phaenosperma globosum Munro,Munro,Phaenosperma globosum Munro,Plantae,,,,Poaceae,Phaenosperma,Japan,Japan,,Atetsu-gun,,Okayama Prefecture,Eastern Asia,Japan,,,,,,,,,,,,http://data.gbif.org/occurrences/295153448,http://data.gbif.org/ws/rest/occurrence/get?key=295153448
"National Museum of Nature and Science, Japan","Plant specimens depodited in Osaka Museum of Natural History, Japan.",,,,,,,OSA,C,OSA395,Specimen,,21:48.0,,,Phaenosperma globosum Munro,Munro,Phaenosperma globosum Munro,Plantae,,,,Poaceae,Phaenosperma,Japan,Japan,Kada to Fukayama,Wakayama-shi,,Wakayama Prefecture,Eastern Asia,Japan,,,,,,,,,,,,http://data.gbif.org/occurrences/295153372,http://data.gbif.org/ws/rest/occurrence/get?key=295153372
"National Museum of Nature and Science, Japan","Plant specimens depodited in Osaka Museum of Natural History, Japan.",,,,,,,OSA,C,OSA7167,Specimen,,21:48.0,,,Phaenosperma globosum Munro,Munro,Phaenosperma globosum Munro,Plantae,,,,Poaceae,Phaenosperma,Japan,Japan,Shodo-shima Island,,,Kagawa Prefecture,Eastern Asia,Japan,,,,,,,,,,,,http://data.gbif.org/occurrences/295153423,http://data.gbif.org/ws/rest/occurrence/get?key=295153423
"National Museum of Nature and Science, Japan","Plant specimens depodited in Osaka Museum of Natural History, Japan.",,,,,,,OSA,C,OSA14826,Specimen,,21:48.0,,,Phaenosperma globosum Munro,Munro,Phaenosperma globosum Munro,Plantae,,,,Poaceae,Phaenosperma,Japan,Japan,"Tanabe Gulf, Kamishima Island",Tanabe-shi,,Wakayama Prefecture,Eastern Asia,Japan,,,,,,,,,,,,http://data.gbif.org/occurrences/295153476,http://data.gbif.org/ws/rest/occurrence/get?key=295153476
"National Museum of Nature and Science, Japan","Plant specimens depodited in Osaka Museum of Natural History, Japan.",,,,,,,OSA,C,OSA74731,Specimen,,21:50.0,,,Phaenosperma globosum Munro,,Phaenosperma globosum Munro,Plantae,,,,Poaceae,Phaenosperma,Japan,Japan,,Wakayama-shi,,Wakyama,Eastern Asia,Japan,,,,,,,,,,,,http://data.gbif.org/occurrences/295153821,http://data.gbif.org/ws/rest/occurrence/get?key=295153821
"National Museum of Nature and Science, Japan",Plant Specimens of The Shimane Nature Museum of Mt. Sanbe,,,,,,,SNMS,P,65,Specimen,,45:55.0,,,Phaenosperma globosum Munro,,Phaenosperma globosum Munro,Plantae,,,Graminales,Gramineae,Phaenosperma,Japan,Japan,,closed,,Wakayama Pref.,Eastern Asia,Japan,,,,,,,,,,,,http://data.gbif.org/occurrences/143955360,http://data.gbif.org/ws/rest/occurrence/get?key=143955360
"National Museum of Nature and Science, Japan",Kochi Prefectural Makino Botanical Garden,,,,,,,MBK,MBK,4833,Specimen,,21:12.0,,,Phaenosperma globosum Munro ex Benth.,Munro ex Benth.,Phaenosperma globosum Munro ex Benth.,Plantae,,,,Poaceae,Phaenosperma,Japan,Japan,Is. Awajishima,,,Hyogo,Eastern Asia,Japan,34.4844,134.928,,44954,49,,,,,,,http://data.gbif.org/occurrences/287507722,http://data.gbif.org/ws/rest/occurrence/get?key=287507722
"National Museum of Nature and Science, Japan",Kochi Prefectural Makino Botanical Garden,,,,,,,MBK,MBK,1580,Specimen,,04:18.0,,,Phaenosperma globosum Munro ex Benth.,Munro ex Benth.,Phaenosperma globosum Munro ex Benth.,Plantae,,,,Poaceae,Phaenosperma,Japan,Japan,,,,Hyogo,Eastern Asia,Japan,,,,,,,,,,,,http://data.gbif.org/occurrences/287514212,http://data.gbif.org/ws/rest/occurrence/get?key=287514212
"National Museum of Nature and Science, Japan",Kochi Prefectural Makino Botanical Garden,,,,,,,MBK,MBK,1577,Specimen,,01:22.0,,,Phaenosperma globosum Munro ex Benth.,Munro ex Benth.,Phaenosperma globosum Munro ex Benth.,Plantae,,,,Poaceae,Phaenosperma,Japan,Japan,Is. Awajishima,,,Hyogo,Eastern Asia,Japan,,,,,,,,,,,,http://data.gbif.org/occurrences/354282530,http://data.gbif.org/ws/rest/occurrence/get?key=354282530
"National Museum of Nature and Science, Japan",Kochi Prefectural Makino Botanical Garden,,,,,,,MBK,MBK,1577,Specimen,,04:18.0,,,Phaenosperma globosum Munro ex Benth.,Munro ex Benth.,Phaenosperma globosum Munro ex Benth.,Plantae,,,,Poaceae,Phaenosperma,Japan,Japan,,,,Hyogo,Eastern Asia,Japan,,,,,,,,,,,,http://data.gbif.org/occurrences/287514206,http://data.gbif.org/ws/rest/occurrence/get?key=287514206
"National Museum of Nature and Science, Japan",Kochi Prefectural Makino Botanical Garden,,,,,,,MBK,MBK,1580,Specimen,,01:22.0,,,Phaenosperma globosum Munro ex Benth.,Munro ex Benth.,Phaenosperma globosum Munro ex Benth.,Plantae,,,,Poaceae,Phaenosperma,Japan,Japan,Is. Awajishima,,,Hyogo,Eastern Asia,Japan,,,,,,,,,,,,http://data.gbif.org/occurrences/354282529,http://data.gbif.org/ws/rest/occurrence/get?key=354282529
"National Museum of Nature and Science, Japan",Kochi Prefectural Makino Botanical Garden,,,,,,,MBK,MBK,4834,Specimen,,21:12.0,,,Phaenosperma globosum Munro ex Benth.,Munro ex Benth.,Phaenosperma globosum Munro ex Benth.,Plantae,,,,Poaceae,Phaenosperma,Japan,Japan,Is. Awajishima,,,Hyogo,Eastern Asia,Japan,34.4844,134.928,,44954,49,,,,,,,http://data.gbif.org/occurrences/287507724,http://data.gbif.org/ws/rest/occurrence/get?key=287507724
"National Museum of Nature and Science, Japan",Vascular plants collection of Hiratsuka City Museum,,,,,,,HCM,56,73633,Specimen,,16:06.0,,,Phaenosperma globosum Munro ex Benth.,Munro ex Benth.,Phaenosperma globosum Munro ex Benth.,Plantae,,,,Gramineae,Phaenosperma,Japan,Japan,,Yokohama-shi,,Kanagawa,Eastern Asia,Japan,,,,,,,,,,,,http://data.gbif.org/occurrences/385736623,http://data.gbif.org/ws/rest/occurrence/get?key=385736623
