Data Publisher,Dataset,Dataset Rights,Collector name,Collector number,Field number,GUID,Date collected,Institution code,Collection code,Catalogue number,Basis of record,Image url,Last indexed,Identifier,Identification date,Scientific name,Author,Scientific name (interpreted),Kingdom,Phylum,Class,Order,Family,Genus,Country,Country (interpreted),Locality,County,Continent or Ocean,State/Province,Region,Publisher country,Latitude,Longitude,Coordinate precision,Cell id,Centi cell id,Min depth,Max depth,Max depth,Min altitude,Max altitude,Altitude precision,GBIF portal url,GBIF webservice url
"National Museum of Nature and Science, Japan",Herbarium of Kitakyushu Museum of Natural History and Human History,,,,,,,KMNH,KMNH,2005807GR16,Specimen,,12:16.0,,,Sedum  tricarpum  Makino,,Sedum tricarpum Makino,Plantae,,,Rosales,Crassulaceae,Sedum,Japan,Japan,,Chikushino City ~ Dazaihu City,,Fukuoka Pref.,Eastern Asia,Japan,,,,,,,,,,,,http://data.gbif.org/occurrences/150198540,http://data.gbif.org/ws/rest/occurrence/get?key=150198540
"National Museum of Nature and Science, Japan",Herbarium of Kitakyushu Museum of Natural History and Human History,,,,,,,KMNH,KMNH,2005807GR15,Specimen,,12:16.0,,,Sedum  tricarpum  Makino,,Sedum tricarpum Makino,Plantae,,,Rosales,Crassulaceae,Sedum,Japan,Japan,,"Soeda Town, Tagawa County",,Fukuoka Pref.,Eastern Asia,Japan,,,,,,,,,,,,http://data.gbif.org/occurrences/150198539,http://data.gbif.org/ws/rest/occurrence/get?key=150198539
"National Museum of Nature and Science, Japan","FKSE-Herbarium specimens of Faculty of Symbiotic Systems Science, Fukushima University, Japan",,,,,,,FKSE,Plant,9163,Specimen,,53:36.0,,,Sedum tricarpum Makino,Makino,Sedum tricarpum Makino,Plantae,,,,CRASSULACEAE,Sedum,Japan,Japan,"Honshu, Shikoku Distr., Ehime Pref., Niihama-shi",,,,Eastern Asia,Japan,,,,,,,,,,,,http://data.gbif.org/occurrences/238099392,http://data.gbif.org/ws/rest/occurrence/get?key=238099392
"National Museum of Nature and Science, Japan",Kochi Prefectural Makino Botanical Garden,,,,,,,MBK,MBK,10818,Specimen,,04:40.0,,,Sedum tricarpum Makino,,Sedum tricarpum Makino,Plantae,,,Rosales,Crassulaceae,Sedum,Japan,Japan,,,,Pref. Kochi,Eastern Asia,Japan,,,,,,,,,,,,http://data.gbif.org/occurrences/143973812,http://data.gbif.org/ws/rest/occurrence/get?key=143973812
"National Museum of Nature and Science, Japan",Kochi Prefectural Makino Botanical Garden,,,,,,,MBK,MBK,10834,Specimen,,04:40.0,,,Sedum tricarpum Makino,,Sedum tricarpum Makino,Plantae,,,Rosales,Crassulaceae,Sedum,Japan,Japan,,,,Pref. Kochi,Eastern Asia,Japan,,,,,,,,,,,,http://data.gbif.org/occurrences/143973820,http://data.gbif.org/ws/rest/occurrence/get?key=143973820
"National Museum of Nature and Science, Japan",Kochi Prefectural Makino Botanical Garden,,,,,,,MBK,MBK,174099,Specimen,,04:43.0,,,Sedum tricarpum Makino,,Sedum tricarpum Makino,Plantae,,,Rosales,Crassulaceae,Sedum,Japan,Japan,,,,Pref. Kochi,Eastern Asia,Japan,,,,,,,,,,,,http://data.gbif.org/occurrences/143974593,http://data.gbif.org/ws/rest/occurrence/get?key=143974593
"National Museum of Nature and Science, Japan",Kochi Prefectural Makino Botanical Garden,,,,,,,MBK,MBK,10833,Specimen,,04:40.0,,,Sedum tricarpum Makino,,Sedum tricarpum Makino,Plantae,,,Rosales,Crassulaceae,Sedum,Japan,Japan,,,,Pref. Kochi,Eastern Asia,Japan,,,,,,,,,,,,http://data.gbif.org/occurrences/143973819,http://data.gbif.org/ws/rest/occurrence/get?key=143973819
"National Museum of Nature and Science, Japan",Kochi Prefectural Makino Botanical Garden,,,,,,,MBK,MBK,10824,Specimen,,04:40.0,,,Sedum tricarpum Makino,,Sedum tricarpum Makino,Plantae,,,Rosales,Crassulaceae,Sedum,Japan,Japan,,,,Pref. Kochi,Eastern Asia,Japan,,,,,,,,,,,,http://data.gbif.org/occurrences/143973814,http://data.gbif.org/ws/rest/occurrence/get?key=143973814
"National Museum of Nature and Science, Japan",Kochi Prefectural Makino Botanical Garden,,,,,,,MBK,MBK,51356,Specimen,,04:42.0,,,Sedum tricarpum Makino,,Sedum tricarpum Makino,Plantae,,,Rosales,Crassulaceae,Sedum,Japan,Japan,,,,Pref. Kochi,Eastern Asia,Japan,,,,,,,,,,,,http://data.gbif.org/occurrences/143974308,http://data.gbif.org/ws/rest/occurrence/get?key=143974308
"National Museum of Nature and Science, Japan",Kochi Prefectural Makino Botanical Garden,,,,,,,MBK,MBK,10825,Specimen,,04:40.0,,,Sedum tricarpum Makino,,Sedum tricarpum Makino,Plantae,,,Rosales,Crassulaceae,Sedum,Japan,Japan,,,,Pref. Kochi,Eastern Asia,Japan,,,,,,,,,,,,http://data.gbif.org/occurrences/143973815,http://data.gbif.org/ws/rest/occurrence/get?key=143973815
"National Museum of Nature and Science, Japan",Plant Specimens of The Shimane Nature Museum of Mt. Sanbe,,,,,,,SNMS,P,15309,Specimen,,46:13.0,,,Sedum tricarpum Makino,Makino,Sedum tricarpum Makino,Plantae,,,Rosales,Crassulaceae,Sedum,Japan,Japan,"Sosen-kyo, Itaigawa","Mito-cho, Mino-gun",,Shimane Pref.,Eastern Asia,Japan,,,,,,,,,,,,http://data.gbif.org/occurrences/390987340,http://data.gbif.org/ws/rest/occurrence/get?key=390987340
