Data Publisher,Dataset,Dataset Rights,Collector name,Collector number,Field number,GUID,Date collected,Institution code,Collection code,Catalogue number,Basis of record,Image url,Last indexed,Identifier,Identification date,Scientific name,Author,Scientific name (interpreted),Kingdom,Phylum,Class,Order,Family,Genus,Country,Country (interpreted),Locality,County,Continent or Ocean,State/Province,Region,Publisher country,Latitude,Longitude,Coordinate precision,Cell id,Centi cell id,Min depth,Max depth,Max depth,Min altitude,Max altitude,Altitude precision,GBIF portal url,GBIF webservice url
"National Museum of Nature and Science, Japan",Kochi Prefectural Makino Botanical Garden,,,,,,,MBK,MBK,3684,Specimen,,23:28.0,,,Tricyrtis flava Maxim. subsp. ohsumiensis (Masam.) Kitam.,Maxim.,Tricyrtis flava subsp. ohsumiensis (Masam.) Kitam.,Plantae,,,,Liliaceae,Tricyrtis,Japan,Japan,Mt. Takakuma-yama,,,Kagoshima,Eastern Asia,Japan,31.2111,130.62,,43870,26,,,,,,,http://data.gbif.org/occurrences/287515468,http://data.gbif.org/ws/rest/occurrence/get?key=287515468
"National Museum of Nature and Science, Japan",Kochi Prefectural Makino Botanical Garden,,,,,,,MBK,MBK,3950,Specimen,,02:22.0,,,Tricyrtis flava Maxim. subsp. ohsumiensis (Masam.) Kitam.,Maxim.,Tricyrtis flava subsp. ohsumiensis (Masam.) Kitam.,Plantae,,,,Liliaceae,Tricyrtis,Japan,Japan,Mt. Takakuma-yama,,,Kagoshima,Eastern Asia,Japan,,,,,,,,,,,,http://data.gbif.org/occurrences/354284587,http://data.gbif.org/ws/rest/occurrence/get?key=354284587
"National Museum of Nature and Science, Japan",Kochi Prefectural Makino Botanical Garden,,,,,,,MBK,MBK,3950,Specimen,,04:54.0,,,Tricyrtis flava Maxim. subsp. ohsumiensis (Masam.) Kitam.,Maxim.,Tricyrtis flava subsp. ohsumiensis (Masam.) Kitam.,Plantae,,,,Liliaceae,Tricyrtis,Japan,Japan,,,,Kagoshima,Eastern Asia,Japan,,,,,,,,,,,,http://data.gbif.org/occurrences/287511987,http://data.gbif.org/ws/rest/occurrence/get?key=287511987
"National Museum of Nature and Science, Japan",Kochi Prefectural Makino Botanical Garden,,,,,,,MBK,MBK,3686,Specimen,,23:28.0,,,Tricyrtis flava Maxim. subsp. ohsumiensis (Masam.) Kitam.,Maxim.,Tricyrtis flava subsp. ohsumiensis (Masam.) Kitam.,Plantae,,,,Liliaceae,Tricyrtis,Japan,Japan,Mt. Takakuma-yama,,,Kagoshima,Eastern Asia,Japan,31.2111,130.62,,43870,26,,,,,,,http://data.gbif.org/occurrences/287515473,http://data.gbif.org/ws/rest/occurrence/get?key=287515473
"National Museum of Nature and Science, Japan",Kochi Prefectural Makino Botanical Garden,,,,,,,MBK,MBK,0002658-C,Specimen,,04:54.0,,,Tricyrtis flava Maxim. subsp. ohsumiensis (Masam.) Kitam.,Maxim.,Tricyrtis flava subsp. ohsumiensis (Masam.) Kitam.,Plantae,,,,Liliaceae,Tricyrtis,Japan,Japan,,,,Kagoshima,Eastern Asia,Japan,,,,,,,,,,,,http://data.gbif.org/occurrences/354284583,http://data.gbif.org/ws/rest/occurrence/get?key=354284583
"National Museum of Nature and Science, Japan",Kochi Prefectural Makino Botanical Garden,,,,,,,MBK,MBK,3683,Specimen,,23:28.0,,,Tricyrtis flava Maxim. subsp. ohsumiensis (Masam.) Kitam.,Maxim.,Tricyrtis flava subsp. ohsumiensis (Masam.) Kitam.,Plantae,,,,Liliaceae,Tricyrtis,Japan,Japan,Mt. Takakuma-yama,,,Kagoshima,Eastern Asia,Japan,31.2111,130.62,,43870,26,,,,,,,http://data.gbif.org/occurrences/287515466,http://data.gbif.org/ws/rest/occurrence/get?key=287515466
"National Museum of Nature and Science, Japan",Kochi Prefectural Makino Botanical Garden,,,,,,,MBK,MBK,0002658-B,Specimen,,04:53.0,,,Tricyrtis flava Maxim. subsp. ohsumiensis (Masam.) Kitam.,Maxim.,Tricyrtis flava subsp. ohsumiensis (Masam.) Kitam.,Plantae,,,,Liliaceae,Tricyrtis,Japan,Japan,,,,Kagoshima,Eastern Asia,Japan,,,,,,,,,,,,http://data.gbif.org/occurrences/354284581,http://data.gbif.org/ws/rest/occurrence/get?key=354284581
"National Museum of Nature and Science, Japan",Kochi Prefectural Makino Botanical Garden,,,,,,,MBK,MBK,3685,Specimen,,23:28.0,,,Tricyrtis flava Maxim. subsp. ohsumiensis (Masam.) Kitam.,Maxim.,Tricyrtis flava subsp. ohsumiensis (Masam.) Kitam.,Plantae,,,,Liliaceae,Tricyrtis,Japan,Japan,Mt. Takakuma-yama,,,Kagoshima,Eastern Asia,Japan,31.2111,130.62,,43870,26,,,,,,,http://data.gbif.org/occurrences/287515470,http://data.gbif.org/ws/rest/occurrence/get?key=287515470
"National Museum of Nature and Science, Japan",Kochi Prefectural Makino Botanical Garden,,,,,,,MBK,MBK,0002658-A,Specimen,,04:53.0,,,Tricyrtis flava Maxim. subsp. ohsumiensis (Masam.) Kitam.,Maxim.,Tricyrtis flava subsp. ohsumiensis (Masam.) Kitam.,Plantae,,,,Liliaceae,Tricyrtis,Japan,Japan,,,,Kagoshima,Eastern Asia,Japan,,,,,,,,,,,,http://data.gbif.org/occurrences/354284578,http://data.gbif.org/ws/rest/occurrence/get?key=354284578
"National Museum of Nature and Science, Japan",Plant Specimens collections of the Kyushu UNniversity Museum,,,,,,,KYUM,FU,NAK01481,Specimen,,16:25.0,,,Tricyrtis ohsumiensis Masamune,,Tricyrtis ohsumiensis Masamune,Plantae,Magnoliophyta,Liliopsida,Liliales,Liliaceae,Tricyrtis,Japan,Japan,,,,Kagoshima Pref.,Eastern Asia,Japan,,,,,,,,,,,,http://data.gbif.org/occurrences/234572790,http://data.gbif.org/ws/rest/occurrence/get?key=234572790
