Data Publisher,Dataset,Dataset Rights,Collector name,Collector number,Field number,GUID,Date collected,Institution code,Collection code,Catalogue number,Basis of record,Image url,Last indexed,Identifier,Identification date,Scientific name,Author,Scientific name (interpreted),Kingdom,Phylum,Class,Order,Family,Genus,Country,Country (interpreted),Locality,County,Continent or Ocean,State/Province,Region,Publisher country,Latitude,Longitude,Coordinate precision,Cell id,Centi cell id,Min depth,Max depth,Max depth,Min altitude,Max altitude,Altitude precision,GBIF portal url,GBIF webservice url
"National Institute of Genetics, ROIS",Herbarium Specimens of Bonin and Ryukyu Islands,,,,,,,TI,ISP,85,Specimen,,19:06.0,,,Piper postelsianum Maxim.,,Piper postelsianum Maxim.,Plantae,,,,PIPERACEAE,Piper,Japan,Japan,"Hahajima, Sekimon-zan",,,,Eastern Asia,Japan,,,,,,,,,,,,http://data.gbif.org/occurrences/690762280,http://data.gbif.org/ws/rest/occurrence/get?key=690762280
"National Institute of Genetics, ROIS",Herbarium Specimens of Bonin and Ryukyu Islands,,,,,,,TI,ISP,106,Specimen,,19:06.0,,,Piper postelsianum Maxim.,,Piper postelsianum Maxim.,Plantae,,,,PIPERACEAE,Piper,Japan,Japan,"Hahajima, Kuwanoki-yama to Sekimon-zan",,,,Eastern Asia,Japan,,,,,,,,,250,400,,http://data.gbif.org/occurrences/690762359,http://data.gbif.org/ws/rest/occurrence/get?key=690762359
"National Institute of Genetics, ROIS",Herbarium Specimens of Bonin and Ryukyu Islands,,,,,,,MAK,ISP,138395,Specimen,,17:37.0,,,Piper postelsianum Maxim.,,Piper postelsianum Maxim.,Plantae,,,,Piperaceae,Piper,Japan,Japan,"Ogasawara Islands, Hahajima Island, Sekimon",,,,Eastern Asia,Japan,,,,,,,,,,,,http://data.gbif.org/occurrences/324134380,http://data.gbif.org/ws/rest/occurrence/get?key=324134380
"National Institute of Genetics, ROIS",Herbarium Specimens of Bonin and Ryukyu Islands,,,,,,,MAK,ISP,125129,Specimen,,17:23.0,,,Piper postelsianum Maxim.,,Piper postelsianum Maxim.,Plantae,,,,Piperaceae,Piper,Japan,Japan,"Ogasawara Islands, Haha-jima Island, Sekimonzan",,,,Eastern Asia,Japan,,,,,,,,,350,350,,http://data.gbif.org/occurrences/324134373,http://data.gbif.org/ws/rest/occurrence/get?key=324134373
"National Institute of Genetics, ROIS",Herbarium Specimens of Bonin and Ryukyu Islands,,,,,,,TI,ISP,107,Specimen,,19:06.0,,,Piper postelsianum Maxim.,,Piper postelsianum Maxim.,Plantae,,,,PIPERACEAE,Piper,Japan,Japan,"Hahajima,  Sekimon",,,,Eastern Asia,Japan,,,,,,,,,,,,http://data.gbif.org/occurrences/690762362,http://data.gbif.org/ws/rest/occurrence/get?key=690762362
"National Institute of Genetics, ROIS",Herbarium Specimens of Bonin and Ryukyu Islands,,,,,,,TI,ISP,110,Specimen,,19:06.0,,,Piper postelsianum Maxim.,,Piper postelsianum Maxim.,Plantae,,,,PIPERACEAE,Piper,Japan,Japan,"Hahajima, Sekimon-zan",,,,Eastern Asia,Japan,,,,,,,,,,,,http://data.gbif.org/occurrences/690762376,http://data.gbif.org/ws/rest/occurrence/get?key=690762376
"National Institute of Genetics, ROIS",Herbarium Specimens of Bonin and Ryukyu Islands,,,,,,,TI,ISP,83,Specimen,,19:06.0,Takashi Tsuyama,,Piper postelsianum Maxim.,,Piper postelsianum Maxim.,Plantae,,,,PIPERACEAE,Piper,Japan,Japan,"Hahajima, Sekimon-zan",,,,Eastern Asia,Japan,,,,,,,,,,,,http://data.gbif.org/occurrences/690762272,http://data.gbif.org/ws/rest/occurrence/get?key=690762272
"National Institute of Genetics, ROIS",Herbarium Specimens of Bonin and Ryukyu Islands,,,,,,,TI,ISP,92,Specimen,,19:06.0,Takashi Tsuyama,,Piper postelsianum Maxim.,,Piper postelsianum Maxim.,Plantae,,,,PIPERACEAE,Piper,Japan,Japan,Hahajima,,,,Eastern Asia,Japan,,,,,,,,,,,,http://data.gbif.org/occurrences/690762307,http://data.gbif.org/ws/rest/occurrence/get?key=690762307
"National Institute of Genetics, ROIS",Herbarium Specimens of Bonin and Ryukyu Islands,,,,,,,TI,ISP,99,Specimen,,19:06.0,Takashi Tsuyama,,Piper postelsianum Maxim.,,Piper postelsianum Maxim.,Plantae,,,,PIPERACEAE,Piper,Japan,Japan,Hahajima,,,,Eastern Asia,Japan,,,,,,,,,,,,http://data.gbif.org/occurrences/690762336,http://data.gbif.org/ws/rest/occurrence/get?key=690762336
"National Institute of Genetics, ROIS",Herbarium Specimens of Bonin and Ryukyu Islands,,,,,,,MAK,ISP,138427,Specimen,,17:37.0,,,Piper postelsianum Maxim.,,Piper postelsianum Maxim.,Plantae,,,,Piperaceae,Piper,Japan,Japan,"Ogasawara Islands, Hahajima Island, Kuwanokiyama - Sekimonzan",,,,Eastern Asia,Japan,,,,,,,,,250,400,,http://data.gbif.org/occurrences/324134363,http://data.gbif.org/ws/rest/occurrence/get?key=324134363
"National Institute of Genetics, ROIS",Herbarium Specimens of Bonin and Ryukyu Islands,,,,,,,MAK,ISP,180638,Specimen,,17:56.0,,,Piper postelsianum Maxim.,,Piper postelsianum Maxim.,Plantae,,,,Piperaceae,Piper,Japan,Japan,"Ogasawara Islands, Hahajima Island, Sakaigatake - Sekimon",,,,Eastern Asia,Japan,,,,,,,,,250,400,,http://data.gbif.org/occurrences/324134400,http://data.gbif.org/ws/rest/occurrence/get?key=324134400
"National Institute of Genetics, ROIS",Herbarium Specimens of Bonin and Ryukyu Islands,,,,,,,TI,ISP,96,Specimen,,19:06.0,Takashi Tsuyama,,Piper postelsianum Maxim.,,Piper postelsianum Maxim.,Plantae,,,,PIPERACEAE,Piper,Japan,Japan,Hahajima,,,,Eastern Asia,Japan,,,,,,,,,,,,http://data.gbif.org/occurrences/690762323,http://data.gbif.org/ws/rest/occurrence/get?key=690762323
"National Institute of Genetics, ROIS",Herbarium Specimens of Bonin and Ryukyu Islands,,,,,,,TI,ISP,93,Specimen,,19:06.0,Takashi Tsuyama,,Piper postelsianum Maxim.,,Piper postelsianum Maxim.,Plantae,,,,PIPERACEAE,Piper,Japan,Japan,Hahajima,,,,Eastern Asia,Japan,,,,,,,,,,,,http://data.gbif.org/occurrences/690762313,http://data.gbif.org/ws/rest/occurrence/get?key=690762313
"National Institute of Genetics, ROIS",Herbarium Specimens of Bonin and Ryukyu Islands,,,,,,,TI,ISP,108,Specimen,,19:06.0,Takashi Tsuyama,,Piper postelsianum Maxim.,,Piper postelsianum Maxim.,Plantae,,,,PIPERACEAE,Piper,Japan,Japan,"Hahajima,  Sekimon-zan",,,,Eastern Asia,Japan,,,,,,,,,,,,http://data.gbif.org/occurrences/690762367,http://data.gbif.org/ws/rest/occurrence/get?key=690762367
"National Institute of Genetics, ROIS",Herbarium Specimens of Bonin and Ryukyu Islands,,,,,,,MAK,ISP,193306,Specimen,,18:06.0,,,Piper postelsianum Maxim.,,Piper postelsianum Maxim.,Plantae,,,,Piperaceae,Piper,Japan,Japan,"Ogasawara Islands, Hahajima Island, Sekimonzan",,,,Eastern Asia,Japan,,,,,,,,,,,,http://data.gbif.org/occurrences/324134405,http://data.gbif.org/ws/rest/occurrence/get?key=324134405
"National Institute of Genetics, ROIS",Herbarium Specimens of Bonin and Ryukyu Islands,,,,,,,TI,ISP,84,Specimen,,19:06.0,Takashi Tsuyama,,Piper postelsianum Maxim.,,Piper postelsianum Maxim.,Plantae,,,,PIPERACEAE,Piper,Japan,Japan,"Hahajima, Sekimon-zan",,,,Eastern Asia,Japan,,,,,,,,,,,,http://data.gbif.org/occurrences/690762276,http://data.gbif.org/ws/rest/occurrence/get?key=690762276
"National Institute of Genetics, ROIS",Herbarium Specimens of Bonin and Ryukyu Islands,,,,,,,TI,ISP,90,Specimen,,19:06.0,,,Piper postelsianum Maxim.,,Piper postelsianum Maxim.,Plantae,,,,PIPERACEAE,Piper,Japan,Japan,"Hahajima, Sekimon-zan",,,,Eastern Asia,Japan,,,,,,,,,,,,http://data.gbif.org/occurrences/690762298,http://data.gbif.org/ws/rest/occurrence/get?key=690762298
"National Institute of Genetics, ROIS",Herbarium Specimens of Bonin and Ryukyu Islands,,,,,,,RYU,ISP,20071,Specimen,,20:19.0,,,Piper postelsianum Maxim.,,Piper postelsianum Maxim.,Plantae,,,,,Piper,Japan,Japan,"Tokyo Pref., Bonins (Ogasawara) Islands, Haha-jima Sekimon",,,Tokyo,Eastern Asia,Japan,,,,,,,,,,,,http://data.gbif.org/occurrences/690795896,http://data.gbif.org/ws/rest/occurrence/get?key=690795896
"National Institute of Genetics, ROIS",Herbarium Specimens of Bonin and Ryukyu Islands,,,,,,,RYU,ISP,33977,Specimen,,20:30.0,,,Piper postelsianum Maxim.,,Piper postelsianum Maxim.,Plantae,,,,,Piper,Japan,Japan,"Tokyo Pref., Bonins (Ogasawara) Islands, Haha-jima Sekimon-yama",,,Tokyo,Eastern Asia,Japan,,,,,,,,,,,,http://data.gbif.org/occurrences/690801169,http://data.gbif.org/ws/rest/occurrence/get?key=690801169
"National Institute of Genetics, ROIS",Herbarium Specimens of Bonin and Ryukyu Islands,,,,,,,MAK,ISP,180637,Specimen,,17:56.0,,,Piper postelsianum Maxim.,,Piper postelsianum Maxim.,Plantae,,,,Piperaceae,Piper,Japan,Japan,"Ogasawara Islands, Hahajima Island, Sekimonzan",,,,Eastern Asia,Japan,,,,,,,,,,,,http://data.gbif.org/occurrences/324134395,http://data.gbif.org/ws/rest/occurrence/get?key=324134395
"National Institute of Genetics, ROIS",Herbarium Specimens of Bonin and Ryukyu Islands,,,,,,,TI,ISP,88,Specimen,,19:06.0,Takashi Tsuyama,,Piper postelsianum Maxim.,,Piper postelsianum Maxim.,Plantae,,,,PIPERACEAE,Piper,Japan,Japan,"Hahajima, Sekimon-zan",,,,Eastern Asia,Japan,,,,,,,,,,,,http://data.gbif.org/occurrences/690762289,http://data.gbif.org/ws/rest/occurrence/get?key=690762289
"National Institute of Genetics, ROIS",Herbarium Specimens of Bonin and Ryukyu Islands,,,,,,,MAK,ISP,126899,Specimen,,17:34.0,,,Piper postelsianum Maxim.,,Piper postelsianum Maxim.,Plantae,,,,Piperaceae,Piper,Japan,Japan,"Ogasawara Islands, Hahajima Island, Sekimon",,,,Eastern Asia,Japan,,,,,,,,,350,350,,http://data.gbif.org/occurrences/324134378,http://data.gbif.org/ws/rest/occurrence/get?key=324134378
"National Institute of Genetics, ROIS",Herbarium Specimens of Bonin and Ryukyu Islands,,,,,,,TI,ISP,86,Specimen,,19:06.0,,,Piper postelsianum Maxim.,,Piper postelsianum Maxim.,Plantae,,,,PIPERACEAE,Piper,Japan,Japan,"Hahajima, Sekimon-zan",,,,Eastern Asia,Japan,,,,,,,,,,,,http://data.gbif.org/occurrences/690762282,http://data.gbif.org/ws/rest/occurrence/get?key=690762282
"National Institute of Genetics, ROIS",Herbarium Specimens of Bonin and Ryukyu Islands,,,,,,,TI,ISP,100,Specimen,,19:06.0,Takashi Tsuyama,,Piper postelsianum Maxim.,,Piper postelsianum Maxim.,Plantae,,,,PIPERACEAE,Piper,Japan,Japan,Hahajima,,,,Eastern Asia,Japan,,,,,,,,,,,,http://data.gbif.org/occurrences/690762338,http://data.gbif.org/ws/rest/occurrence/get?key=690762338
"National Institute of Genetics, ROIS",Herbarium Specimens of Bonin and Ryukyu Islands,,,,,,,TI,ISP,95,Specimen,,19:06.0,Takashi Tsuyama,,Piper postelsianum Maxim.,,Piper postelsianum Maxim.,Plantae,,,,PIPERACEAE,Piper,Japan,Japan,Hahajima,,,,Eastern Asia,Japan,,,,,,,,,,,,http://data.gbif.org/occurrences/690762319,http://data.gbif.org/ws/rest/occurrence/get?key=690762319
"National Institute of Genetics, ROIS",Herbarium Specimens of Bonin and Ryukyu Islands,,,,,,,MAK,ISP,29553,Specimen,,17:11.0,,,Piper postelsianum Maxim.,,Piper postelsianum Maxim.,Plantae,,,,Piperaceae,Piper,Japan,Japan,Ogasawara Islands,,,,Eastern Asia,Japan,,,,,,,,,,,,http://data.gbif.org/occurrences/324134369,http://data.gbif.org/ws/rest/occurrence/get?key=324134369
"National Institute of Genetics, ROIS",Herbarium Specimens of Bonin and Ryukyu Islands,,,,,,,TI,ISP,89,Specimen,,19:06.0,Takashi Tsuyama,,Piper postelsianum Maxim.,,Piper postelsianum Maxim.,Plantae,,,,PIPERACEAE,Piper,Japan,Japan,"Hahajima, Sekimon-zan",,,,Eastern Asia,Japan,,,,,,,,,,,,http://data.gbif.org/occurrences/690762293,http://data.gbif.org/ws/rest/occurrence/get?key=690762293
"National Institute of Genetics, ROIS",Herbarium Specimens of Bonin and Ryukyu Islands,,,,,,,TI,ISP,87,Specimen,,19:06.0,Takashi Tsuyama,,Piper postelsianum Maxim.,,Piper postelsianum Maxim.,Plantae,,,,PIPERACEAE,Piper,Japan,Japan,"Hahajima, Sekimon-zan",,,,Eastern Asia,Japan,,,,,,,,,,,,http://data.gbif.org/occurrences/690762285,http://data.gbif.org/ws/rest/occurrence/get?key=690762285
"National Institute of Genetics, ROIS",Herbarium Specimens of Bonin and Ryukyu Islands,,,,,,,TI,ISP,98,Specimen,,19:06.0,Takashi Tsuyama,,Piper postelsianum Maxim.,,Piper postelsianum Maxim.,Plantae,,,,PIPERACEAE,Piper,Japan,Japan,Hahajima,,,,Eastern Asia,Japan,,,,,,,,,,,,http://data.gbif.org/occurrences/690762331,http://data.gbif.org/ws/rest/occurrence/get?key=690762331
"National Institute of Genetics, ROIS",Herbarium Specimens of Bonin and Ryukyu Islands,,,,,,,MAK,ISP,216416,Specimen,,18:13.0,,,Piper postelsianum Maxim.,,Piper postelsianum Maxim.,Plantae,,,,Piperaceae,Piper,Japan,Japan,"Ogasawara Islands, Hahajima Island, Sekimon",,,,Eastern Asia,Japan,,,,,,,,,,,,http://data.gbif.org/occurrences/324134404,http://data.gbif.org/ws/rest/occurrence/get?key=324134404
"National Institute of Genetics, ROIS",Herbarium Specimens of Bonin and Ryukyu Islands,,,,,,,TI,ISP,103,Specimen,,19:06.0,Hiroshi Hara,,Piper postelsianum Maxim.,,Piper postelsianum Maxim.,Plantae,,,,PIPERACEAE,Piper,Japan,Japan,"Hahajima, Sekimon-zan",,,,Eastern Asia,Japan,,,,,,,,,,,,http://data.gbif.org/occurrences/690762351,http://data.gbif.org/ws/rest/occurrence/get?key=690762351
"National Institute of Genetics, ROIS",Herbarium Specimens of Bonin and Ryukyu Islands,,,,,,,TI,ISP,91,Specimen,,19:06.0,Takashi Tsuyama,,Piper postelsianum Maxim.,,Piper postelsianum Maxim.,Plantae,,,,PIPERACEAE,Piper,Japan,Japan,Hahajima,,,,Eastern Asia,Japan,,,,,,,,,,,,http://data.gbif.org/occurrences/690762302,http://data.gbif.org/ws/rest/occurrence/get?key=690762302
"National Institute of Genetics, ROIS",Herbarium Specimens of Bonin and Ryukyu Islands,,,,,,,TI,ISP,109,Specimen,,19:06.0,,,Piper postelsianum Maxim.,,Piper postelsianum Maxim.,Plantae,,,,PIPERACEAE,Piper,Japan,Japan,,,,,Eastern Asia,Japan,,,,,,,,,,,,http://data.gbif.org/occurrences/690762371,http://data.gbif.org/ws/rest/occurrence/get?key=690762371
"National Institute of Genetics, ROIS",Herbarium Specimens of Bonin and Ryukyu Islands,,,,,,,TI,ISP,104,Specimen,,20:35.0,,,Piper postelsianum Maxim.,,Piper postelsianum Maxim.,Plantae,,,,PIPERACEAE,Piper,Japan,Japan,,,,,Eastern Asia,Japan,,,,,,,,,,,,http://data.gbif.org/occurrences/690804145,http://data.gbif.org/ws/rest/occurrence/get?key=690804145
"National Institute of Genetics, ROIS",Herbarium Specimens of Bonin and Ryukyu Islands,,,,,,,MAK,ISP,169419,Specimen,,17:50.0,,,Piper postelsianum Maxim.,,Piper postelsianum Maxim.,Plantae,,,,Piperaceae,Piper,Japan,Japan,"Ogasawara Islands, Hahajima Island, Sekimonzan",,,,Eastern Asia,Japan,,,,,,,,,,,,http://data.gbif.org/occurrences/324134386,http://data.gbif.org/ws/rest/occurrence/get?key=324134386
"National Institute of Genetics, ROIS",Herbarium Specimens of Bonin and Ryukyu Islands,,,,,,,MAK,ISP,184120,Specimen,,18:01.0,,,Piper postelsianum Maxim.,,Piper postelsianum Maxim.,Plantae,,,,Piperaceae,Piper,Japan,Japan,"Ogasawara Islands, Hahajima Island, Sakaigatake - Sekimon",,,,Eastern Asia,Japan,,,,,,,,,,,,http://data.gbif.org/occurrences/324134401,http://data.gbif.org/ws/rest/occurrence/get?key=324134401
"National Institute of Genetics, ROIS",Herbarium Specimens of Bonin and Ryukyu Islands,,,,,,,MAK,ISP,300654,Specimen,,18:39.0,,,Piper postelsianum Maxim.,,Piper postelsianum Maxim.,Plantae,,,,Piperaceae,Piper,Japan,Japan,"Ogasawara Islands, Hahajima Island, Sekimonzan (Osaka Univ. cult.)",,,,Eastern Asia,Japan,,,,,,,,,,,,http://data.gbif.org/occurrences/690753519,http://data.gbif.org/ws/rest/occurrence/get?key=690753519
"National Institute of Genetics, ROIS",Herbarium Specimens of Bonin and Ryukyu Islands,,,,,,,TI,ISP,105,Specimen,,19:06.0,,,Piper postelsianum Maxim.,,Piper postelsianum Maxim.,Plantae,,,,PIPERACEAE,Piper,Japan,Japan,"Chichijima, Renju-dani",,,,Eastern Asia,Japan,,,,,,,,,,,,http://data.gbif.org/occurrences/690762355,http://data.gbif.org/ws/rest/occurrence/get?key=690762355
"National Institute of Genetics, ROIS",Herbarium Specimens of Bonin and Ryukyu Islands,,,,,,,MAK,ISP,173625,Specimen,,17:51.0,,,Piper postelsianum Maxim.,,Piper postelsianum Maxim.,Plantae,,,,Piperaceae,Piper,Japan,Japan,"Ogasawara Islands, Hahajima Island, Igumadani - Sekimonzan",,,,Eastern Asia,Japan,,,,,,,,,,,,http://data.gbif.org/occurrences/324134391,http://data.gbif.org/ws/rest/occurrence/get?key=324134391
"National Institute of Genetics, ROIS",Herbarium Specimens of Bonin and Ryukyu Islands,,,,,,,TI,ISP,94,Specimen,,19:06.0,Takashi Tsuyama,,Piper postelsianum Maxim.,,Piper postelsianum Maxim.,Plantae,,,,PIPERACEAE,Piper,Japan,Japan,Hahajima,,,,Eastern Asia,Japan,,,,,,,,,,,,http://data.gbif.org/occurrences/690762317,http://data.gbif.org/ws/rest/occurrence/get?key=690762317
"National Institute of Genetics, ROIS",Herbarium Specimens of Bonin and Ryukyu Islands,,,,,,,MAK,ISP,162701,Specimen,,17:44.0,,,Piper postelsianum Maxim.,,Piper postelsianum Maxim.,Plantae,,,,Piperaceae,Piper,Japan,Japan,"Ogasawara Islands, Hahajima Island, Sekimonzan",,,,Eastern Asia,Japan,,,,,,,,,,,,http://data.gbif.org/occurrences/324134383,http://data.gbif.org/ws/rest/occurrence/get?key=324134383
"National Institute of Genetics, ROIS",Herbarium Specimens of Bonin and Ryukyu Islands,,,,,,,TI,ISP,101,Specimen,,19:06.0,Takashi Tsuyama,,Piper postelsianum Maxim.,,Piper postelsianum Maxim.,Plantae,,,,PIPERACEAE,Piper,Japan,Japan,"Hahajima, Sekimon-zan",,,,Eastern Asia,Japan,,,,,,,,,,,,http://data.gbif.org/occurrences/690762341,http://data.gbif.org/ws/rest/occurrence/get?key=690762341
"National Institute of Genetics, ROIS",Herbarium Specimens of Bonin and Ryukyu Islands,,,,,,,MAK,ISP,29552,Specimen,,17:11.0,,,Piper postelsianum Maxim.,,Piper postelsianum Maxim.,Plantae,,,,Piperaceae,Piper,Japan,Japan,Ogasawara Islands,,,,Eastern Asia,Japan,,,,,,,,,,,,http://data.gbif.org/occurrences/324109179,http://data.gbif.org/ws/rest/occurrence/get?key=324109179
"National Institute of Genetics, ROIS",Herbarium Specimens of Bonin and Ryukyu Islands,,,,,,,TI,ISP,97,Specimen,,19:06.0,Takashi Tsuyama,,Piper postelsianum Maxim.,,Piper postelsianum Maxim.,Plantae,,,,PIPERACEAE,Piper,Japan,Japan,Hahajima,,,,Eastern Asia,Japan,,,,,,,,,,,,http://data.gbif.org/occurrences/690762327,http://data.gbif.org/ws/rest/occurrence/get?key=690762327
"National Institute of Genetics, ROIS",Herbarium Specimens of Bonin and Ryukyu Islands,,,,,,,TI,ISP,102,Specimen,,19:06.0,Hiroshi Hara,,Piper postelsianum Maxim.,,Piper postelsianum Maxim.,Plantae,,,,PIPERACEAE,Piper,Japan,Japan,"Hahajima, Sekimon-zan",,,,Eastern Asia,Japan,,,,,,,,,,,,http://data.gbif.org/occurrences/690762346,http://data.gbif.org/ws/rest/occurrence/get?key=690762346
"Netherlands Centre for Biodiversity Naturalis, section National Herbarium of the Netherlands",Nationaal Herbarium Nederland,,"Murata, G",,543,,00:00.0,L,L,894680,Specimen,,41:42.0,,,Piper postelsianum Maxim.,,Piper postelsianum Maxim.,,,,,Piperaceae,Piper,Japan,Japan,Bonin,,,,Eastern Asia,Netherlands,,,,,,,,,,,,http://data.gbif.org/occurrences/298370876,http://data.gbif.org/ws/rest/occurrence/get?key=298370876
