Data Publisher,Dataset,Dataset Rights,Collector name,Collector number,Field number,GUID,Date collected,Institution code,Collection code,Catalogue number,Basis of record,Image url,Last indexed,Identifier,Identification date,Scientific name,Author,Scientific name (interpreted),Kingdom,Phylum,Class,Order,Family,Genus,Country,Country (interpreted),Locality,County,Continent or Ocean,State/Province,Region,Publisher country,Latitude,Longitude,Coordinate precision,Cell id,Centi cell id,Min depth,Max depth,Max depth,Min altitude,Max altitude,Altitude precision,GBIF portal url,GBIF webservice url
"National Museum of Nature and Science, Japan",Angiosperm specimens of Iwate Prefectural Museum,,,,,,,IPMM,PA,74071,Specimen,,59:46.0,,,Impatiens textorii Miq.  f. pallescens (Honda) H.Hara,Miq.,Impatiens textorii f. pallescens (Honda) H.Hara,Plantae,Angiospermae,Dicotyledoneae,,Balsaminaceae,Impatiens,Japan,Japan,,Iwate-gun Shizukuishicho,,Iwate,Eastern Asia,Japan,,,,,,,,,,,,http://data.gbif.org/occurrences/93885793,http://data.gbif.org/ws/rest/occurrence/get?key=93885793
"National Museum of Nature and Science, Japan",Angiosperm specimens of Iwate Prefectural Museum,,,,,,,IPMM,PA,74080,Specimen,,59:46.0,,,Impatiens textorii Miq.  f. pallescens (Honda) H.Hara,Miq.,Impatiens textorii f. pallescens (Honda) H.Hara,Plantae,Angiospermae,Dicotyledoneae,,Balsaminaceae,Impatiens,Japan,Japan,,Kamaishi-shi,,Iwate,Eastern Asia,Japan,,,,,,,,,,,,http://data.gbif.org/occurrences/93885799,http://data.gbif.org/ws/rest/occurrence/get?key=93885799
"National Museum of Nature and Science, Japan",Angiosperm specimens of Iwate Prefectural Museum,,,,,,,IPMM,PA,74070,Specimen,,59:46.0,,,Impatiens textorii Miq.  f. pallescens (Honda) H.Hara,Miq.,Impatiens textorii f. pallescens (Honda) H.Hara,Plantae,Angiospermae,Dicotyledoneae,,Balsaminaceae,Impatiens,Japan,Japan,,Morioka-shi,,Iwate,Eastern Asia,Japan,,,,,,,,,,,,http://data.gbif.org/occurrences/93885788,http://data.gbif.org/ws/rest/occurrence/get?key=93885788
"National Museum of Nature and Science, Japan",Angiosperm specimens of Iwate Prefectural Museum,,,,,,,IPMM,PA,74073,Specimen,,59:46.0,,,Impatiens textorii Miq.  f. pallescens (Honda) H.Hara,Miq.,Impatiens textorii f. pallescens (Honda) H.Hara,Plantae,Angiospermae,Dicotyledoneae,,Balsaminaceae,Impatiens,Japan,Japan,,Ofunato-shi,,Iwate,Eastern Asia,Japan,,,,,,,,,,,,http://data.gbif.org/occurrences/93885797,http://data.gbif.org/ws/rest/occurrence/get?key=93885797
"National Museum of Nature and Science, Japan",Angiosperm specimens of Iwate Prefectural Museum,,,,,,,IPMM,PA,74072,Specimen,,59:46.0,,,Impatiens textorii Miq.  f. pallescens (Honda) H.Hara,Miq.,Impatiens textorii f. pallescens (Honda) H.Hara,Plantae,Angiospermae,Dicotyledoneae,,Balsaminaceae,Impatiens,Japan,Japan,,Shimohei-gun Yamadamachi,,Iwate,Eastern Asia,Japan,,,,,,,,,,,,http://data.gbif.org/occurrences/93885798,http://data.gbif.org/ws/rest/occurrence/get?key=93885798
"National Museum of Nature and Science, Japan",Angiosperm specimens of Iwate Prefectural Museum,,,,,,,IPMM,PA,72930,Specimen,,59:46.0,,,Impatiens textorii Miq.  f. pallescens (Honda) H.Hara,Miq.,Impatiens textorii f. pallescens (Honda) H.Hara,Plantae,Angiospermae,Dicotyledoneae,,Balsaminaceae,Impatiens,Japan,Japan,,Iwate-gun Shizukuishicho,,Iwate,Eastern Asia,Japan,,,,,,,,,,,,http://data.gbif.org/occurrences/93885789,http://data.gbif.org/ws/rest/occurrence/get?key=93885789
"National Museum of Nature and Science, Japan","FKSE-Herbarium specimens of Faculty of Symbiotic Systems Science, Fukushima University, Japan",,,,,,,FKSE,Plant,9898,Specimen,,52:02.0,,,Impatiens textorii Miq.  f. pallescens (Honda) H.Hara,Miq.,Impatiens textorii f. pallescens (Honda) H.Hara,Plantae,,,,BALSAMINACEAE,Impatiens,Japan,Japan,"Honshu, Tohoku Distr., Fukushima Pref., Fukushima-shi, Matsukawamachi-mizuhara, the west slope of Sasamori-yama,",,,,Eastern Asia,Japan,37.65,140.383,,46040,63,,,,380,430,,http://data.gbif.org/occurrences/238094445,http://data.gbif.org/ws/rest/occurrence/get?key=238094445
"National Museum of Nature and Science, Japan",Vascular plants collection of Hiratsuka City Museum,,,,,,,HCM,56,74217,Specimen,,15:31.0,,,Impatiens textorii Miq. f. pallescens (Honda) H.Hara,Miq.,Impatiens textorii f. pallescens (Honda) H.Hara,Plantae,,,,Balsaminaceae,Impatiens,Japan,Japan,,Fujisawa-shi,,Kanagawa,Eastern Asia,Japan,,,,,,,,,,,,http://data.gbif.org/occurrences/385732051,http://data.gbif.org/ws/rest/occurrence/get?key=385732051
"National Museum of Nature and Science, Japan",Plant Specimens of Kurashiki Museum of Natural History,,,,,,,KURA,KURA,143123,Specimen,,15:28.0,,,Impatiens textorii Miq. forma pallescens (Honda) H.Hara,Miq.,Impatiens textorii f. pallescens (Honda) H.Hara,Plantae,,,Sapindales,Balsaminaceae,Impatiens,Japan,Japan,,Aba-son,,Okayama,Eastern Asia,Japan,,,,,,,,,,,,http://data.gbif.org/occurrences/395771145,http://data.gbif.org/ws/rest/occurrence/get?key=395771145
"National Museum of Nature and Science, Japan",Plant Specimens of Kurashiki Museum of Natural History,,,,,,,KURA,KURA,64478,Specimen,,15:28.0,,,Impatiens textorii Miq. forma pallescens (Honda) H.Hara,Miq.,Impatiens textorii f. pallescens (Honda) H.Hara,Plantae,,,Sapindales,Balsaminaceae,Impatiens,Japan,Japan,,Higashiawakura-son,,Okayama,Eastern Asia,Japan,,,,,,,,,,,,http://data.gbif.org/occurrences/395770921,http://data.gbif.org/ws/rest/occurrence/get?key=395770921
"National Museum of Nature and Science, Japan",Plant Specimens of Kurashiki Museum of Natural History,,,,,,,KURA,KURA,143964,Specimen,,15:28.0,,,Impatiens textorii Miq. forma pallescens (Honda) H.Hara,Miq.,Impatiens textorii f. pallescens (Honda) H.Hara,Plantae,,,Sapindales,Balsaminaceae,Impatiens,Japan,Japan,,Oosa-cho,,Okayama,Eastern Asia,Japan,,,,,,,,,,,,http://data.gbif.org/occurrences/395771148,http://data.gbif.org/ws/rest/occurrence/get?key=395771148
"National Museum of Nature and Science, Japan",Plant Specimens of Kurashiki Museum of Natural History,,,,,,,KURA,KURA,139265,Specimen,,15:28.0,,,Impatiens textorii Miq. forma pallescens (Honda) H.Hara,Miq.,Impatiens textorii f. pallescens (Honda) H.Hara,Plantae,,,Sapindales,Balsaminaceae,Impatiens,Japan,Japan,,Aba-son,,Okayama,Eastern Asia,Japan,,,,,,,,,,,,http://data.gbif.org/occurrences/395771138,http://data.gbif.org/ws/rest/occurrence/get?key=395771138
"National Museum of Nature and Science, Japan",Plant Specimens of Kurashiki Museum of Natural History,,,,,,,KURA,KURA,90505,Specimen,,15:28.0,,,Impatiens textorii Miq. forma pallescens (Honda) H.Hara,Miq.,Impatiens textorii f. pallescens (Honda) H.Hara,Plantae,,,Sapindales,Balsaminaceae,Impatiens,Japan,Japan,,Shoboku-cho,,Okayama,Eastern Asia,Japan,,,,,,,,,,,,http://data.gbif.org/occurrences/395771007,http://data.gbif.org/ws/rest/occurrence/get?key=395771007
