Data Publisher,Dataset,Dataset Rights,Collector name,Collector number,Field number,GUID,Date collected,Institution code,Collection code,Catalogue number,Basis of record,Image url,Last indexed,Identifier,Identification date,Scientific name,Author,Scientific name (interpreted),Kingdom,Phylum,Class,Order,Family,Genus,Country,Country (interpreted),Locality,County,Continent or Ocean,State/Province,Region,Publisher country,Latitude,Longitude,Coordinate precision,Cell id,Centi cell id,Min depth,Max depth,Max depth,Min altitude,Max altitude,Altitude precision,GBIF portal url,GBIF webservice url
"National Museum of Nature and Science, Japan",Herbarium of Kitakyushu Museum of Natural History and Human History,,,,,,,KMNH,KMNH,1997312GR07,Specimen,,11:23.0,,,Cardamine   impatiens   L.,,Cardamine impatiens L.,Plantae,,,Papaverales,Cruciferae,Cardamine,Japan,Japan,"Kamiyokoshiro, Kokuraminami Ward",Kitakyushu City,,Fukuoka  Pref.,Eastern Asia,Japan,,,,,,,,,,,,http://data.gbif.org/occurrences/150188937,http://data.gbif.org/ws/rest/occurrence/get?key=150188937
"National Museum of Nature and Science, Japan",Herbarium of Kitakyushu Museum of Natural History and Human History,,,,,,,KMNH,KMNH,2000410GR09,Specimen,,11:23.0,,,Cardamine   impatiens   L.,,Cardamine impatiens L.,Plantae,,,Papaverales,Cruciferae,Cardamine,Japan,Japan,"Kagumeyoshi, Kokuraminami Ward",Kitakyushu City,,Fukuoka  Pref.,Eastern Asia,Japan,,,,,,,,,,,,http://data.gbif.org/occurrences/150188938,http://data.gbif.org/ws/rest/occurrence/get?key=150188938
"National Institute of Genetics, ROIS","Herbarium Specimens of Museum of Nature and Human Activities, Hyogo Pref., Japan",,,,,,,HYO,VP,C1-117675,Specimen,,21:14.0,T.Kobayashi,,Cardamine impatiens,,Cardamine impatiens,Plantae,Magnoliophyta,,,Cruciferae,Cardamine,Japan,Japan,"Hyogo Pref.; Nishinomiya-shi, Shiose-cho-najio.",,,Hyogo,Eastern Asia,Japan,135.317,34.8333,,,,,,,100,300,,http://data.gbif.org/occurrences/323487381,http://data.gbif.org/ws/rest/occurrence/get?key=323487381
"National Institute of Genetics, ROIS","Herbarium Specimens of Museum of Nature and Human Activities, Hyogo Pref., Japan",,,,,,,HYO,VP,C1-109285,Specimen,,26:40.0,,,Cardamine impatiens,,Cardamine impatiens,Plantae,Magnoliophyta,,,Cruciferae,Cardamine,Japan,Japan,"Pref. Nagano: Shimashimatani, Azumi-mura, Minamiazumi-gun.",,,Nagano,Eastern Asia,Japan,137.783,36.1833,,,,,,,800,900,,http://data.gbif.org/occurrences/323523704,http://data.gbif.org/ws/rest/occurrence/get?key=323523704
"National Institute of Genetics, ROIS","Herbarium Specimens of Museum of Nature and Human Activities, Hyogo Pref., Japan",,,,,,,HYO,VP,C1-008748,Specimen,,20:31.0,,,Cardamine impatiens,,Cardamine impatiens,Plantae,Magnoliophyta,,,Cruciferae,Cardamine,Japan,Japan,"Hyogo Pref.; Mihara-gun, Seidan-cho, Matsuho",,,Hyogo,Eastern Asia,Japan,,,,,,,,,,,,http://data.gbif.org/occurrences/323479846,http://data.gbif.org/ws/rest/occurrence/get?key=323479846
"National Institute of Genetics, ROIS","Herbarium Specimens of Museum of Nature and Human Activities, Hyogo Pref., Japan",,,,,,,HYO,VP,C1-109325,Specimen,,26:40.0,,,Cardamine impatiens,,Cardamine impatiens,Plantae,Magnoliophyta,,,Cruciferae,Cardamine,Japan,Japan,"Pref. Nagano: Shimashimatani-minamisawa, Azumi-mura, Minamiazumi-gun.",,,Nagano,Eastern Asia,Japan,137.767,36.2167,,,,,,,900,1000,,http://data.gbif.org/occurrences/323523719,http://data.gbif.org/ws/rest/occurrence/get?key=323523719
"National Institute of Genetics, ROIS","Herbarium Specimens of Museum of Nature and Human Activities, Hyogo Pref., Japan",,,,,,,HYO,VP,C1-075532,Specimen,,18:00.0,T.Fujii,,Cardamine impatiens,,Cardamine impatiens,Plantae,Magnoliophyta,,,Cruciferae,Cardamine,Japan,Japan,"Hyogo Pref.; Kobe-shi, Kita-ku, Kawashimogawa.",,,Hyogo,Eastern Asia,Japan,,,,,,,,,,,,http://data.gbif.org/occurrences/323452688,http://data.gbif.org/ws/rest/occurrence/get?key=323452688
"National Institute of Genetics, ROIS","Herbarium Specimens of Museum of Nature and Human Activities, Hyogo Pref., Japan",,,,,,,HYO,VP,C1-077322,Specimen,,26:17.0,,,Cardamine impatiens,,Cardamine impatiens,Plantae,Magnoliophyta,,,Cruciferae,Cardamine,Japan,Japan,"Nagasaki Pref.; Tsushima Isl., Shimogata-gun, Mitushima-cho, Mt. Shiroyama.",,,Nagasaki,Eastern Asia,Japan,,,,,,,,,50,250,,http://data.gbif.org/occurrences/323521390,http://data.gbif.org/ws/rest/occurrence/get?key=323521390
"National Institute of Genetics, ROIS","Herbarium Specimens of Museum of Nature and Human Activities, Hyogo Pref., Japan",,,,,,,HYO,VP,C1-103070,Specimen,,27:41.0,H.Ikeda,,Cardamine impatiens,,Cardamine impatiens,Plantae,Magnoliophyta,,,Cruciferae,Cardamine,Japan,Japan,"Ugakei, Asa-cho, Asakitaku, Hiroshima-shi",,,Hiroshima,Eastern Asia,Japan,,,,,,,,,,,,http://data.gbif.org/occurrences/323529720,http://data.gbif.org/ws/rest/occurrence/get?key=323529720
"National Institute of Genetics, ROIS","Herbarium Specimens of Museum of Nature and Human Activities, Hyogo Pref., Japan",,,,,,,HYO,VP,C1-131460,Specimen,,25:48.0,T.Suzuki,,Cardamine impatiens,,Cardamine impatiens,Plantae,Magnoliophyta,,,Cruciferae,Cardamine,Japan,Japan,"KANTO: CHIBA Pref. Kimitsu City, Goudai,Kurotaki ( Chiba forest of Tokyo Univ.) alt200m",,,Chiba,Eastern Asia,Japan,140.1,35.2,,,,,,,,,,http://data.gbif.org/occurrences/323518643,http://data.gbif.org/ws/rest/occurrence/get?key=323518643
"National Institute of Genetics, ROIS","Herbarium Specimens of Museum of Nature and Human Activities, Hyogo Pref., Japan",,,,,,,HYO,VP,C1-010325,Specimen,,20:18.0,,,Cardamine impatiens,,Cardamine impatiens,Plantae,Magnoliophyta,,,Cruciferae,Cardamine,Japan,Japan,"Hyogo Pref.; Mihara-gun, Seidan-cho, Matsuho",,,Hyogo,Eastern Asia,Japan,,,,,,,,,,,,http://data.gbif.org/occurrences/323477560,http://data.gbif.org/ws/rest/occurrence/get?key=323477560
"National Institute of Genetics, ROIS","Herbarium Specimens of Museum of Nature and Human Activities, Hyogo Pref., Japan",,,,,,,HYO,VP,C1-160173,Specimen,,21:21.0,,,Cardamine impatiens,,Cardamine impatiens,Plantae,Magnoliophyta,,,Cruciferae,Cardamine,Japan,Japan,"Hyogo Pref.; Nishinomiya-shi, Shiose-cho-namaze to Takedao.",,,Hyogo,Eastern Asia,Japan,135.317,34.8167,,,,,,,,,,http://data.gbif.org/occurrences/323488763,http://data.gbif.org/ws/rest/occurrence/get?key=323488763
"National Institute of Genetics, ROIS","Herbarium Specimens of Museum of Nature and Human Activities, Hyogo Pref., Japan",,,,,,,HYO,VP,C1-075537,Specimen,,18:00.0,T.Fujii,,Cardamine impatiens,,Cardamine impatiens,Plantae,Magnoliophyta,,,Cruciferae,Cardamine,Japan,Japan,"Hyogo Pref.; Kobe-shi, Kita-ku, Kawashimogawa.",,,Hyogo,Eastern Asia,Japan,,,,,,,,,,,,http://data.gbif.org/occurrences/323452691,http://data.gbif.org/ws/rest/occurrence/get?key=323452691
"National Institute of Genetics, ROIS","Herbarium Specimens of Museum of Nature and Human Activities, Hyogo Pref., Japan",,,,,,,HYO,VP,C1-077382,Specimen,,25:21.0,A.Takahashi,,Cardamine impatiens,,Cardamine impatiens,Plantae,Magnoliophyta,,,Cruciferae,Cardamine,Japan,Japan,"Hyogo Pref.; Yabu-gun, Ohya-cho, Ikada.",,,Hyogo,Eastern Asia,Japan,134.633,35.3333,,,,,,,350,350,,http://data.gbif.org/occurrences/323515919,http://data.gbif.org/ws/rest/occurrence/get?key=323515919
"National Institute of Genetics, ROIS","Herbarium Specimens of Museum of Nature and Human Activities, Hyogo Pref., Japan",,,,,,,HYO,VP,C1-070225,Specimen,,17:28.0,,,Cardamine impatiens,,Cardamine impatiens,Plantae,Magnoliophyta,,,Cruciferae,Cardamine,Japan,Japan,"Hyogo Pref.; Kanzaki-gun, Ookouchi-cho, Tonomine",,,Hyogo,Eastern Asia,Japan,134.7,35.15,,,,,,,600,600,,http://data.gbif.org/occurrences/323446160,http://data.gbif.org/ws/rest/occurrence/get?key=323446160
"National Institute of Genetics, ROIS","Herbarium Specimens of Museum of Nature and Human Activities, Hyogo Pref., Japan",,,,,,,HYO,VP,C1-077340,Specimen,,25:24.0,A.Takahashi,,Cardamine impatiens,,Cardamine impatiens,Plantae,Magnoliophyta,,,Cruciferae,Cardamine,Japan,Japan,"Hyogo Pref.; Yabu-gun, Ohya-cho, Tentaki.",,,Hyogo,Eastern Asia,Japan,134.617,35.3333,,,,,,,350,600,,http://data.gbif.org/occurrences/323516273,http://data.gbif.org/ws/rest/occurrence/get?key=323516273
"National Institute of Genetics, ROIS","Herbarium Specimens of Museum of Nature and Human Activities, Hyogo Pref., Japan",,,,,,,HYO,VP,C1-057158,Specimen,,25:39.0,,,Cardamine impatiens,,Cardamine impatiens,Plantae,Magnoliophyta,,,Cruciferae,Cardamine,Japan,Japan,"Ichikuraga-take Mt., Kanazawa-shi",,,Ishikawa,Eastern Asia,Japan,,,,,,,,,,,,http://data.gbif.org/occurrences/323517777,http://data.gbif.org/ws/rest/occurrence/get?key=323517777
"National Institute of Genetics, ROIS","Herbarium Specimens of Museum of Nature and Human Activities, Hyogo Pref., Japan",,,,,,,HYO,VP,C1-106075,Specimen,,20:47.0,,,Cardamine impatiens,,Cardamine impatiens,Plantae,Magnoliophyta,,,Cruciferae,Cardamine,Japan,Japan,"Hyogo Pref.; Mihara-gun, Seidan-cho, Matsuho",,,Hyogo,Eastern Asia,Japan,134.667,35.0333,,,,,,,,,,http://data.gbif.org/occurrences/323482493,http://data.gbif.org/ws/rest/occurrence/get?key=323482493
"National Institute of Genetics, ROIS","Herbarium Specimens of Museum of Nature and Human Activities, Hyogo Pref., Japan",,,,,,,HYO,VP,C1-062182,Specimen,,21:23.0,A.Takahashi,,Cardamine impatiens,,Cardamine impatiens,Plantae,Magnoliophyta,,,Cruciferae,Cardamine,Japan,Japan,"Hyogo Pref.; Nishinomiya-shi, Takedao,along Muko-river. Ca. 120 m alt.",,,Hyogo,Eastern Asia,Japan,,,,,,,,,120,120,,http://data.gbif.org/occurrences/323489015,http://data.gbif.org/ws/rest/occurrence/get?key=323489015
"National Institute of Genetics, ROIS","Herbarium Specimens of Museum of Nature and Human Activities, Hyogo Pref., Japan",,,,,,,HYO,VP,C1-160428,Specimen,,21:22.0,,,Cardamine impatiens,,Cardamine impatiens,Plantae,Magnoliophyta,,,Cruciferae,Cardamine,Japan,Japan,"Hyogo Pref.; Nishinomiya-shi, Shiose-cho-namaze to Takedao.",,,Hyogo,Eastern Asia,Japan,135.317,34.8167,,,,,,,,,,http://data.gbif.org/occurrences/323488765,http://data.gbif.org/ws/rest/occurrence/get?key=323488765
"National Institute of Genetics, ROIS","Herbarium Specimens of Museum of Nature and Human Activities, Hyogo Pref., Japan",,,,,,,HYO,VP,C1-010179,Specimen,,22:00.0,,,Cardamine impatiens,,Cardamine impatiens,Plantae,Magnoliophyta,,,Cruciferae,Cardamine,Japan,Japan,"Hyogo-ken: Asago-gun, Wadayama-cho, Asagi-yama",,,Hyogo,Eastern Asia,Japan,,,,,,,,,,,,http://data.gbif.org/occurrences/323496192,http://data.gbif.org/ws/rest/occurrence/get?key=323496192
"National Institute of Genetics, ROIS","Herbarium Specimens of Museum of Nature and Human Activities, Hyogo Pref., Japan",,,,,,,HYO,VP,C1-137790,Specimen,,25:34.0,,,Cardamine impatiens,,Cardamine impatiens,Plantae,Magnoliophyta,,,Cruciferae,Cardamine,Japan,Japan,"Hyogo Pref.; Yabu-gun, Yohka-cho, Yagi.",,,Hyogo,Eastern Asia,Japan,134.717,35.3833,,,,,,,300,400,,http://data.gbif.org/occurrences/323517211,http://data.gbif.org/ws/rest/occurrence/get?key=323517211
"National Institute of Genetics, ROIS","Herbarium Specimens of Museum of Nature and Human Activities, Hyogo Pref., Japan",,,,,,,HYO,VP,C1-167897,Specimen,,16:56.0,,,Cardamine impatiens,,Cardamine impatiens,Plantae,Magnoliophyta,,,Cruciferae,Cardamine,Japan,Japan,"Hyogo Pref.; Ako-gun, Kamigohri-cho, Ootomi, Nishidani.",,,Hyogo,Eastern Asia,Japan,134.383,34.9333,,,,,,,,,,http://data.gbif.org/occurrences/323438443,http://data.gbif.org/ws/rest/occurrence/get?key=323438443
"National Museum of Nature and Science, Japan",Angiospermatatophytina Collection of Saitama Museum of Natural History,,,,,,,SMNH,As,25205,Specimen,,52:21.0,,,Cardamine impatiens L.,L.,Cardamine impatiens L.,Plantae,Angiospermae,Dicotyledoneae,Papaverales,Cruciferae,Cardamine,Japan,Japan,Kunugidaira,Hiki-gun Tokigawamura,,Saitama,Eastern Asia,Japan,,,,,,,,,,,,http://data.gbif.org/occurrences/393093365,http://data.gbif.org/ws/rest/occurrence/get?key=393093365
"National Museum of Nature and Science, Japan",Angiospermatatophytina Collection of Saitama Museum of Natural History,,,,,,,SMNH,As,25204,Specimen,,52:21.0,,,Cardamine impatiens L.,L.,Cardamine impatiens L.,Plantae,Angiospermae,Dicotyledoneae,Papaverales,Cruciferae,Cardamine,Japan,Japan,Kunugidaira,Hiki-gun Tokigawamura,,Saitama,Eastern Asia,Japan,,,,,,,,,,,,http://data.gbif.org/occurrences/393093364,http://data.gbif.org/ws/rest/occurrence/get?key=393093364
"National Museum of Nature and Science, Japan",Angiospermatatophytina Collection of Saitama Museum of Natural History,,,,,,,SMNH,As,9025,Specimen,,52:18.0,,,Cardamine impatiens L.,L.,Cardamine impatiens L.,Plantae,Angiospermae,Dicotyledoneae,Papaverales,Cruciferae,Cardamine,Japan,Japan,Mt. Dodaira-san,Chichibu-gun Higashichichibumura,,Saitama,Eastern Asia,Japan,,,,,,,,,,,,http://data.gbif.org/occurrences/393092626,http://data.gbif.org/ws/rest/occurrence/get?key=393092626
"National Museum of Nature and Science, Japan",Angiosperm specimens of Iwate Prefectural Museum,,,,,,,IPMM,PA,4731,Specimen,,59:29.0,,,Cardamine impatiens L.,L.,Cardamine impatiens L.,Plantae,Angiospermae,Dicotyledoneae,Papaverales,Cruciferae,Cardamine,Japan,Japan,,Aizuwakamatsu-shi,,Fukushima,Eastern Asia,Japan,,,,,,,,,,,,http://data.gbif.org/occurrences/204231620,http://data.gbif.org/ws/rest/occurrence/get?key=204231620
"National Museum of Nature and Science, Japan",Angiosperm specimens of Iwate Prefectural Museum,,,,,,,IPMM,PA,22812,Specimen,,59:30.0,,,Cardamine impatiens L.,L.,Cardamine impatiens L.,Plantae,Angiospermae,Dicotyledoneae,Papaverales,Cruciferae,Cardamine,Japan,Japan,,Ninohe-shi,,Iwate,Eastern Asia,Japan,,,,,,,,,,,,http://data.gbif.org/occurrences/204231719,http://data.gbif.org/ws/rest/occurrence/get?key=204231719
"National Museum of Nature and Science, Japan",Angiosperm specimens of Iwate Prefectural Museum,,,,,,,IPMM,PA,70867,Specimen,,59:28.0,,,Cardamine impatiens L.,L.,Cardamine impatiens L.,Plantae,Angiospermae,Dicotyledoneae,,Cruciferae,Cardamine,Japan,Japan,,Tono-shi,,Iwate,Eastern Asia,Japan,,,,,,,,,,,,http://data.gbif.org/occurrences/93882061,http://data.gbif.org/ws/rest/occurrence/get?key=93882061
"National Museum of Nature and Science, Japan",Angiospermatatophytina Collection of Saitama Museum of Natural History,,,,,,,SMNH,As,9024,Specimen,,52:18.0,,,Cardamine impatiens L.,L.,Cardamine impatiens L.,Plantae,Angiospermae,Dicotyledoneae,Papaverales,Cruciferae,Cardamine,Japan,Japan,Urayama,Chichibu-shi,,Saitama,Eastern Asia,Japan,,,,,,,,,,,,http://data.gbif.org/occurrences/393092625,http://data.gbif.org/ws/rest/occurrence/get?key=393092625
"National Museum of Nature and Science, Japan",Angiospermatatophytina Collection of Saitama Museum of Natural History,,,,,,,SMNH,As,25208,Specimen,,52:21.0,,,Cardamine impatiens L.,L.,Cardamine impatiens L.,Plantae,Angiospermae,Dicotyledoneae,Papaverales,Cruciferae,Cardamine,Japan,Japan,Nishidaira,Hiki-gun Tokigawamura,,Saitama,Eastern Asia,Japan,,,,,,,,,,,,http://data.gbif.org/occurrences/393093368,http://data.gbif.org/ws/rest/occurrence/get?key=393093368
"National Museum of Nature and Science, Japan",Angiospermatatophytina Collection of Saitama Museum of Natural History,,,,,,,SMNH,As,9026,Specimen,,52:18.0,,,Cardamine impatiens L.,L.,Cardamine impatiens L.,Plantae,Angiospermae,Dicotyledoneae,Papaverales,Cruciferae,Cardamine,Japan,Japan,Urayama,Chichibu-shi,,Saitama,Eastern Asia,Japan,,,,,,,,,,,,http://data.gbif.org/occurrences/393092627,http://data.gbif.org/ws/rest/occurrence/get?key=393092627
"National Museum of Nature and Science, Japan",Angiospermatatophytina Collection of Saitama Museum of Natural History,,,,,,,SMNH,As,9023,Specimen,,52:18.0,,,Cardamine impatiens L.,L.,Cardamine impatiens L.,Plantae,Angiospermae,Dicotyledoneae,Papaverales,Cruciferae,Cardamine,Japan,Japan,Mt. Ryokami-san,Chichibu-gun Ryokamimura,,Saitama,Eastern Asia,Japan,,,,,,,,,,,,http://data.gbif.org/occurrences/393092624,http://data.gbif.org/ws/rest/occurrence/get?key=393092624
"National Museum of Nature and Science, Japan",Angiospermatatophytina Collection of Saitama Museum of Natural History,,,,,,,SMNH,As,25209,Specimen,,52:21.0,,,Cardamine impatiens L.,L.,Cardamine impatiens L.,Plantae,Angiospermae,Dicotyledoneae,Papaverales,Cruciferae,Cardamine,Japan,Japan,Nishidaira,Hiki-gun Tokigawamura,,Saitama,Eastern Asia,Japan,,,,,,,,,,,,http://data.gbif.org/occurrences/393093369,http://data.gbif.org/ws/rest/occurrence/get?key=393093369
"National Museum of Nature and Science, Japan",Angiosperm specimens of Iwate Prefectural Museum,,,,,,,IPMM,PA,119203,Specimen,,59:32.0,,,Cardamine impatiens L.,L.,Cardamine impatiens L.,Plantae,Angiospermae,Dicotyledoneae,Papaverales,Cruciferae,Cardamine,Japan,Japan,,Hanamaki-shi,,Iwate,Eastern Asia,Japan,,,,,,,,,,,,http://data.gbif.org/occurrences/204232171,http://data.gbif.org/ws/rest/occurrence/get?key=204232171
"National Museum of Nature and Science, Japan",Angiospermatatophytina Collection of Saitama Museum of Natural History,,,,,,,SMNH,As,25203,Specimen,,52:21.0,,,Cardamine impatiens L.,L.,Cardamine impatiens L.,Plantae,Angiospermae,Dicotyledoneae,Papaverales,Cruciferae,Cardamine,Japan,Japan,Nishidaira,Hiki-gun Tokigawamura,,Saitama,Eastern Asia,Japan,,,,,,,,,,,,http://data.gbif.org/occurrences/393093363,http://data.gbif.org/ws/rest/occurrence/get?key=393093363
"National Museum of Nature and Science, Japan",Angiospermatatophytina Collection of Saitama Museum of Natural History,,,,,,,SMNH,As,25206,Specimen,,52:21.0,,,Cardamine impatiens L.,L.,Cardamine impatiens L.,Plantae,Angiospermae,Dicotyledoneae,Papaverales,Cruciferae,Cardamine,Japan,Japan,Kunugidaira,Hiki-gun Tokigawamura,,Saitama,Eastern Asia,Japan,,,,,,,,,,,,http://data.gbif.org/occurrences/393093366,http://data.gbif.org/ws/rest/occurrence/get?key=393093366
"National Museum of Nature and Science, Japan",Angiospermatatophytina Collection of Saitama Museum of Natural History,,,,,,,SMNH,As,25210,Specimen,,52:21.0,,,Cardamine impatiens L.,L.,Cardamine impatiens L.,Plantae,Angiospermae,Dicotyledoneae,Papaverales,Cruciferae,Cardamine,Japan,Japan,Ono,Hiki-gun Tokigawamura,,Saitama,Eastern Asia,Japan,,,,,,,,,,,,http://data.gbif.org/occurrences/393093370,http://data.gbif.org/ws/rest/occurrence/get?key=393093370
"National Museum of Nature and Science, Japan",Angiospermatatophytina Collection of Saitama Museum of Natural History,,,,,,,SMNH,As,25207,Specimen,,52:21.0,,,Cardamine impatiens L.,L.,Cardamine impatiens L.,Plantae,Angiospermae,Dicotyledoneae,Papaverales,Cruciferae,Cardamine,Japan,Japan,Kunugidaira,Hiki-gun Tokigawamura,,Saitama,Eastern Asia,Japan,,,,,,,,,,,,http://data.gbif.org/occurrences/393093367,http://data.gbif.org/ws/rest/occurrence/get?key=393093367
"National Museum of Nature and Science, Japan",Angiosperm specimens of Iwate Prefectural Museum,,,,,,,IPMM,PA,70866,Specimen,,59:28.0,,,Cardamine impatiens L.,L.,Cardamine impatiens L.,Plantae,Angiospermae,Dicotyledoneae,,Cruciferae,Cardamine,Japan,Japan,,Matsumoto-shi,,Nagano,Eastern Asia,Japan,,,,,,,,,,,,http://data.gbif.org/occurrences/93882062,http://data.gbif.org/ws/rest/occurrence/get?key=93882062
"National Museum of Nature and Science, Japan",Angiospermatatophytina Collection of Saitama Museum of Natural History,,,,,,,SMNH,As,22968,Specimen,,52:20.0,,,Cardamine impatiens L.,L.,Cardamine impatiens L.,Plantae,Angiospermae,Dicotyledoneae,Papaverales,Cruciferae,Cardamine,Japan,Japan,Mt. Wanagura-san,Chichibu-gun Otakimura,,Saitama,Eastern Asia,Japan,,,,,,,,,,,,http://data.gbif.org/occurrences/393093283,http://data.gbif.org/ws/rest/occurrence/get?key=393093283
"National Museum of Nature and Science, Japan",Angiospermatatophytina Collection of Saitama Museum of Natural History,,,,,,,SMNH,As,22969,Specimen,,52:20.0,,,Cardamine impatiens L.,L.,Cardamine impatiens L.,Plantae,Angiospermae,Dicotyledoneae,Papaverales,Cruciferae,Cardamine,Japan,Japan,Mt. Happu-san,Chichibu-gun Minanomachi,,Saitama,Eastern Asia,Japan,,,,,,,,,,,,http://data.gbif.org/occurrences/393093284,http://data.gbif.org/ws/rest/occurrence/get?key=393093284
"National Museum of Nature and Science, Japan","Botanical specimens database of Mr. Jiro Ito collection, Shizuoka Prefecture Museum of Natural History",,,,,,,SPMN,a,SPMN-a-543,Specimen,,37:36.0,,,Cardamine impatiens L.,L.,Cardamine impatiens L.,Plantae,Magnoliophyta,Magnoliopsida,Brassicales,Brassicaceae,Cardamine,Japan,Japan,,Fujinomiya-shi,,Shizuoka,Eastern Asia,Japan,,,,,,,,,,,,http://data.gbif.org/occurrences/380182161,http://data.gbif.org/ws/rest/occurrence/get?key=380182161
"National Museum of Nature and Science, Japan","Gunma Museum of Natural History, Vascular Plant Specimen",,,,,,,GMNHJ,plant,BS0051135,Specimen,,34:23.0,,,Cardamine impatiens L.,L.,Cardamine impatiens L.,Plantae,Spermatophyta,Dicotyledoneae,,Brassicaceae,Cardamine,Japan,Japan,"Mt. Narukami,Umedacho",Kiryu-shi,,Gunma,Eastern Asia,Japan,36.4903,139.362,,45679,43,,,,,,,http://data.gbif.org/occurrences/295232750,http://data.gbif.org/ws/rest/occurrence/get?key=295232750
"National Museum of Nature and Science, Japan","Gunma Museum of Natural History, Vascular Plant Specimen",,,,,,,GMNHJ,plant,BS0006995,Specimen,,34:23.0,,,Cardamine impatiens L.,L.,Cardamine impatiens L.,Plantae,Spermatophyta,Dicotyledoneae,,Cruciferae,Cardamine,Japan,Japan,"Yubiso,Yubiso",Tone-gun Minakamimachi,,Gunma,Eastern Asia,Japan,,,,,,,,,580,580,,http://data.gbif.org/occurrences/394052226,http://data.gbif.org/ws/rest/occurrence/get?key=394052226
"National Museum of Nature and Science, Japan","Gunma Museum of Natural History, Vascular Plant Specimen",,,,,,,GMNHJ,plant,BS0012871,Specimen,,34:24.0,,,Cardamine impatiens L.,L.,Cardamine impatiens L.,Plantae,Spermatophyta,Dicotyledoneae,,Cruciferae,Cardamine,Japan,Japan,"Hisamori,Hayashi",Agatsuma-gun Naganoharamachi,,Gunma,Eastern Asia,Japan,,,,,,,,,540,540,,http://data.gbif.org/occurrences/394052430,http://data.gbif.org/ws/rest/occurrence/get?key=394052430
"National Museum of Nature and Science, Japan","Gunma Museum of Natural History, Vascular Plant Specimen",,,,,,,GMNHJ,plant,BS0033772,Specimen,,34:22.0,,,Cardamine impatiens L.,L.,Cardamine impatiens L.,Plantae,Spermatophyta,Dicotyledoneae,,Brassicaceae,Cardamine,Japan,Japan,"Kariyado,Yokiya",Agatsuma-gun Naganoharamachi,,Gunma,Eastern Asia,Japan,36.5039,138.613,,45678,56,,,,,,,http://data.gbif.org/occurrences/295232669,http://data.gbif.org/ws/rest/occurrence/get?key=295232669
"National Museum of Nature and Science, Japan","Gunma Museum of Natural History, Vascular Plant Specimen",,,,,,,GMNHJ,plant,BS0006055,Specimen,,34:23.0,,,Cardamine impatiens L.,L.,Cardamine impatiens L.,Plantae,Spermatophyta,Dicotyledoneae,,Cruciferae,Cardamine,Japan,Japan,"Onuma-jinja Shrine,Onuma",Tone-gun Minakamimachi,,Gunma,Eastern Asia,Japan,,,,,,,,,800,800,,http://data.gbif.org/occurrences/394052211,http://data.gbif.org/ws/rest/occurrence/get?key=394052211
"National Museum of Nature and Science, Japan","FKSE-Herbarium specimens of Faculty of Symbiotic Systems Science, Fukushima University, Japan",,,,,,,FKSE,Plant,14381,Specimen,,51:10.0,,,Cardamine impatiens L.,L.,Cardamine impatiens L.,Plantae,,,,BRASSICACEAE,Cardamine,Japan,Japan,"Tohoku Distr., Fukushima Pref., Fukushima-shi, Watari, along Abukuma River,",,,,Eastern Asia,Japan,37,140,,46040,0,,,,110,,,http://data.gbif.org/occurrences/238088998,http://data.gbif.org/ws/rest/occurrence/get?key=238088998
"National Museum of Nature and Science, Japan","FKSE-Herbarium specimens of Faculty of Symbiotic Systems Science, Fukushima University, Japan",,,,,,,FKSE,Plant,8714,Specimen,,51:10.0,,,Cardamine impatiens L.,L.,Cardamine impatiens L.,Plantae,,,,BRASSICACEAE,Cardamine,Japan,Japan,"Honshu, Tohoku Distr., Fukushima Pref., Koriyama-shi, Atamimachi, Fukazawa",,,,Eastern Asia,Japan,,,,,,,,,,,,http://data.gbif.org/occurrences/238089094,http://data.gbif.org/ws/rest/occurrence/get?key=238089094