Data Publisher,Dataset,Dataset Rights,Collector name,Collector number,Field number,GUID,Date collected,Institution code,Collection code,Catalogue number,Basis of record,Image url,Last indexed,Identifier,Identification date,Scientific name,Author,Scientific name (interpreted),Kingdom,Phylum,Class,Order,Family,Genus,Country,Country (interpreted),Locality,County,Continent or Ocean,State/Province,Region,Publisher country,Latitude,Longitude,Coordinate precision,Cell id,Centi cell id,Min depth,Max depth,Max depth,Min altitude,Max altitude,Altitude precision,GBIF portal url,GBIF webservice url
"National Museum of Nature and Science, Japan",Herbarium of Kitakyushu Museum of Natural History and Human History,,,,,,,KMNH,KMNH,2000Y01GR33,Specimen,,11:57.0,,,Maackia   tashiroi   (Yatabe)  Makino,,Maackia tashiroi (Yatabe) Makino,Plantae,,,Rosales,Leguminosae,Maackia,Japan,Japan,,"Tamanoura Town, Minamimatsuura County",,Nagasaki  Pref.,Eastern Asia,Japan,,,,,,,,,,,,http://data.gbif.org/occurrences/150195276,http://data.gbif.org/ws/rest/occurrence/get?key=150195276
"National Institute of Genetics, ROIS","Herbarium Specimens of Museum of Nature and Human Activities, Hyogo Pref., Japan",,,,,,,HYO,VP,C1-121808,Specimen,,25:57.0,,,Maackia tashiroi,,Maackia tashiroi,Plantae,Magnoliophyta,,,Leguminosae,Maackia,Japan,Japan,"Kohchi Prif.; Muroto-shi, Muroto-misaki",,,Kochi,Eastern Asia,Japan,134.183,33.2333,,,,,,,10,10,,http://data.gbif.org/occurrences/323519358,http://data.gbif.org/ws/rest/occurrence/get?key=323519358
"National Institute of Genetics, ROIS","Herbarium Specimens of Museum of Nature and Human Activities, Hyogo Pref., Japan",,,,,,,HYO,VP,C1-049287,Specimen,,25:42.0,,,Maackia tashiroi,,Maackia tashiroi,Plantae,Magnoliophyta,,,Leguminosae,Maackia,Japan,Japan,"Isl. Tanagasima, Nisinoomote-shi, Fukagawa",,,Kagoshima,Eastern Asia,Japan,,,,,,,,,,,,http://data.gbif.org/occurrences/323518100,http://data.gbif.org/ws/rest/occurrence/get?key=323518100
"National Museum of Nature and Science, Japan","Plant specimens depodited in Osaka Museum of Natural History, Japan.",,,,,,,OSA,C,OSA23426,Specimen,,20:58.0,,,Maackia tashiroi (Yatabe) Mak.,(Yatabe) Mak.,Maackia tashiroi (Yatabe) Mak.,Plantae,,,,Fabaceae,Maackia,Japan,Japan,Amami-Ohshima Island,,,Kagoshima Prefecture,Eastern Asia,Japan,,,,,,,,,,,,http://data.gbif.org/occurrences/295147062,http://data.gbif.org/ws/rest/occurrence/get?key=295147062
"National Museum of Nature and Science, Japan","Plant specimens depodited in Osaka Museum of Natural History, Japan.",,,,,,,OSA,C,OSA23441,Specimen,,20:58.0,,,Maackia tashiroi (yatabe) Mak.,(yatabe) Mak.,Maackia tashiroi,Plantae,,,,Fabaceae,Maackia,Japan,Japan,Amami-Ohshima Island,,,Kagoshima Prefecture,Eastern Asia,Japan,,,,,,,,,,,,http://data.gbif.org/occurrences/295147063,http://data.gbif.org/ws/rest/occurrence/get?key=295147063
"National Museum of Nature and Science, Japan","Plant specimens depodited in Osaka Museum of Natural History, Japan.",,,,,,,OSA,C,OSA24803,Specimen,,20:58.0,,,Maackia tashiroi (Yatabe) Mak.,(Yatabe) Mak.,Maackia tashiroi (Yatabe) Mak.,Plantae,,,,Fabaceae,Maackia,Japan,Japan,Okinoerabu-jima Island,,,Kagoshima Prefecture,Eastern Asia,Japan,,,,,,,,,,,,http://data.gbif.org/occurrences/295147081,http://data.gbif.org/ws/rest/occurrence/get?key=295147081
"National Museum of Nature and Science, Japan","Plant specimens depodited in Osaka Museum of Natural History, Japan.",,,,,,,OSA,C,OSA25344,Specimen,,20:58.0,,,Maackia tashiroi (Yatabe) Mak.,(Yatabe) Mak.,Maackia tashiroi (Yatabe) Mak.,Plantae,,,,Fabaceae,Maackia,Japan,Japan,Amami-Ohshima Island,,,Kagoshima Prefecture,Eastern Asia,Japan,,,,,,,,,,,,http://data.gbif.org/occurrences/295147094,http://data.gbif.org/ws/rest/occurrence/get?key=295147094
"National Museum of Nature and Science, Japan",Kochi Prefectural Makino Botanical Garden,,,,,,,MBK,MBK,4462,Specimen,,00:56.0,,,Maackia tashiroi (Yatabe) Makino,(Yatabe) Makino,Maackia tashiroi (Yatabe) Makino,Plantae,,,,Leguminosae,Maackia,Japan,Japan,Muroto-misaki cape,Muroto-shi,,Kochi,Eastern Asia,Japan,,,,,,,,,,,,http://data.gbif.org/occurrences/354282044,http://data.gbif.org/ws/rest/occurrence/get?key=354282044
"National Museum of Nature and Science, Japan",Kochi Prefectural Makino Botanical Garden,,,,,,,MBK,MBK,79652,Specimen,,04:01.0,,,Maackia tashiroi (Yatabe) Makino,,Maackia tashiroi (Yatabe) Makino,Plantae,,,Rosales,Leguminosae,Maackia,Japan,Japan,,,,Pref. Kochi,Eastern Asia,Japan,,,,,,,,,,,,http://data.gbif.org/occurrences/143969234,http://data.gbif.org/ws/rest/occurrence/get?key=143969234
"National Museum of Nature and Science, Japan",Kochi Prefectural Makino Botanical Garden,,,,,,,MBK,MBK,5275,Specimen,,00:14.0,,,Maackia tashiroi (Yatabe) Makino,(Yatabe) Makino,Maackia tashiroi (Yatabe) Makino,Plantae,,,,Leguminosae,Maackia,Japan,Japan,Muroto-misaki cape,Muroto-shi,,Kochi,Eastern Asia,Japan,33.2688,134.166,,44594,21,,,,,,,http://data.gbif.org/occurrences/287504612,http://data.gbif.org/ws/rest/occurrence/get?key=287504612
"National Museum of Nature and Science, Japan",Kochi Prefectural Makino Botanical Garden,,,,,,,MBK,MBK,6680,Specimen,,03:58.0,,,Maackia tashiroi (Yatabe) Makino,,Maackia tashiroi (Yatabe) Makino,Plantae,,,Rosales,Leguminosae,Maackia,Japan,Japan,,,,Pref. Kochi,Eastern Asia,Japan,,,,,,,,,,,,http://data.gbif.org/occurrences/143968575,http://data.gbif.org/ws/rest/occurrence/get?key=143968575
"National Museum of Nature and Science, Japan",Kochi Prefectural Makino Botanical Garden,,,,,,,MBK,MBK,6681,Specimen,,03:58.0,,,Maackia tashiroi (Yatabe) Makino,,Maackia tashiroi (Yatabe) Makino,Plantae,,,Rosales,Leguminosae,Maackia,Japan,Japan,,,,Pref. Kochi,Eastern Asia,Japan,,,,,,,,,,,,http://data.gbif.org/occurrences/143968576,http://data.gbif.org/ws/rest/occurrence/get?key=143968576
"National Museum of Nature and Science, Japan",Kochi Prefectural Makino Botanical Garden,,,,,,,MBK,MBK,6683,Specimen,,03:58.0,,,Maackia tashiroi (Yatabe) Makino,,Maackia tashiroi (Yatabe) Makino,Plantae,,,Rosales,Leguminosae,Maackia,Japan,Japan,,,,Pref. Kochi,Eastern Asia,Japan,,,,,,,,,,,,http://data.gbif.org/occurrences/143968578,http://data.gbif.org/ws/rest/occurrence/get?key=143968578
"National Museum of Nature and Science, Japan",Kochi Prefectural Makino Botanical Garden,,,,,,,MBK,MBK,4462,Specimen,,04:03.0,,,Maackia tashiroi (Yatabe) Makino,(Yatabe) Makino,Maackia tashiroi (Yatabe) Makino,Plantae,,,,Leguminosae,Maackia,Japan,Japan,,Muroto-shi,,Kochi,Eastern Asia,Japan,,,,,,,,,,,,http://data.gbif.org/occurrences/287492573,http://data.gbif.org/ws/rest/occurrence/get?key=287492573
"National Museum of Nature and Science, Japan",Kochi Prefectural Makino Botanical Garden,,,,,,,MBK,MBK,6682,Specimen,,03:58.0,,,Maackia tashiroi (Yatabe) Makino,,Maackia tashiroi (Yatabe) Makino,Plantae,,,Rosales,Leguminosae,Maackia,Japan,Japan,,,,Pref. Kochi,Eastern Asia,Japan,,,,,,,,,,,,http://data.gbif.org/occurrences/143968577,http://data.gbif.org/ws/rest/occurrence/get?key=143968577
"National Institute of Genetics, ROIS","Plant Specimen Database of Tama Forest Science Garden, Forestry and Forest Products Research Institute, Japan",,,,,,,FFPRI,TFA,14862,Specimen,,22:49.0,,,Maackia tashiroi (Yatabe) Makino,,Maackia tashiroi (Yatabe) Makino,Plantae,Magnoliophyta,Magnoliopsida,Fabales,Fabaceae,Maackia,Japan,Japan,Yakusima,Kumage County,,Kagosima Prefecture,Eastern Asia,Japan,30.27226,130.42332,,43510,24,,,,,,,http://data.gbif.org/occurrences/360258156,http://data.gbif.org/ws/rest/occurrence/get?key=360258156
"National Institute of Genetics, ROIS","Plant Specimen Database of Tama Forest Science Garden, Forestry and Forest Products Research Institute, Japan",,,,,,,FFPRI,TFA,14859,Specimen,,22:49.0,,,Maackia tashiroi (Yatabe) Makino,,Maackia tashiroi (Yatabe) Makino,Plantae,Magnoliophyta,Magnoliopsida,Fabales,Fabaceae,Maackia,Japan,Japan,Yakusima,Kumage County,,Kagosima Prefecture,Eastern Asia,Japan,30.27226,130.42332,,43510,24,,,,,,,http://data.gbif.org/occurrences/360258153,http://data.gbif.org/ws/rest/occurrence/get?key=360258153
"National Institute of Genetics, ROIS","Plant Specimen Database of Tama Forest Science Garden, Forestry and Forest Products Research Institute, Japan",,,,,,,FFPRI,TFA,14861,Specimen,,22:49.0,,,Maackia tashiroi (Yatabe) Makino,,Maackia tashiroi (Yatabe) Makino,Plantae,Magnoliophyta,Magnoliopsida,Fabales,Fabaceae,Maackia,Japan,Japan,Yakusima,Kumage County,,Kagosima Prefecture,Eastern Asia,Japan,30.27226,130.42332,,43510,24,,,,,,,http://data.gbif.org/occurrences/360258155,http://data.gbif.org/ws/rest/occurrence/get?key=360258155
"National Institute of Genetics, ROIS","Plant Specimen Database of Tama Forest Science Garden, Forestry and Forest Products Research Institute, Japan",,,,,,,FFPRI,TFA,14860,Specimen,,22:49.0,,,Maackia tashiroi (Yatabe) Makino,,Maackia tashiroi (Yatabe) Makino,Plantae,Magnoliophyta,Magnoliopsida,Fabales,Fabaceae,Maackia,Japan,Japan,Yakusima,Kumage County,,Kagosima Prefecture,Eastern Asia,Japan,30.27226,130.42332,,43510,24,,,,,,,http://data.gbif.org/occurrences/360258154,http://data.gbif.org/ws/rest/occurrence/get?key=360258154
"National Museum of Nature and Science, Japan",Plant Specimens of Kurashiki Museum of Natural History,,,,,,,KURA,KURA,134837,Specimen,,16:13.0,,,Maackia tashiroi (Yatabe) Makino,(Yatabe) Makino,Maackia tashiroi (Yatabe) Makino,Plantae,,,,Leguminosae,Maackia,Japan,Japan,,,,Kagashima,Eastern Asia,Japan,,,,,,,,,,,,http://data.gbif.org/occurrences/43148966,http://data.gbif.org/ws/rest/occurrence/get?key=43148966
"National Museum of Nature and Science, Japan",Plant Specimens of Kurashiki Museum of Natural History,,,,,,,KURA,KURA,134836,Specimen,,16:13.0,,,Maackia tashiroi (Yatabe) Makino,(Yatabe) Makino,Maackia tashiroi (Yatabe) Makino,Plantae,,,,Leguminosae,Maackia,Japan,Japan,,,,Kagashima,Eastern Asia,Japan,,,,,,,,,,,,http://data.gbif.org/occurrences/43148967,http://data.gbif.org/ws/rest/occurrence/get?key=43148967
"National Museum of Nature and Science, Japan","Plant specimens depodited in Osaka Museum of Natural History, Japan.",,,,,,,OSA,C,OSA1551,Specimen,,20:57.0,,,Maackia tashiroi (Yatabe) Makino,(Yatabe) Makino,Maackia tashiroi (Yatabe) Makino,Plantae,,,,Fabaceae,Maackia,Japan,Japan,Yakushima Island,,,Kagoshima Prefecture,Eastern Asia,Japan,,,,,,,,,,,,http://data.gbif.org/occurrences/295146939,http://data.gbif.org/ws/rest/occurrence/get?key=295146939
"National Museum of Nature and Science, Japan","Plant specimens depodited in Osaka Museum of Natural History, Japan.",,,,,,,OSA,C,OSA50508,Specimen,,20:59.0,,,Maackia tashiroi (Yatabe) Makino,(Yatabe) Makino,Maackia tashiroi (Yatabe) Makino,Plantae,,,,Fabaceae,Maackia,Japan,Japan,Tanami Tanosaki,Higashimuro-gun Kushimotocho,,Wakayama Prefecture,Eastern Asia,Japan,,,,,,,,,,,,http://data.gbif.org/occurrences/295147287,http://data.gbif.org/ws/rest/occurrence/get?key=295147287
"National Museum of Nature and Science, Japan","Plant specimens depodited in Osaka Museum of Natural History, Japan.",,,,,,,OSA,C,OSA50509,Specimen,,20:59.0,,,Maackia tashiroi (Yatabe) Makino,(Yatabe) Makino,Maackia tashiroi (Yatabe) Makino,Plantae,,,,Fabaceae,Maackia,Japan,Japan,Tanami Tanosaki,Higashimuro-gun Kushimotocho,,Wakayama Prefecture,Eastern Asia,Japan,,,,,,,,,,,,http://data.gbif.org/occurrences/295147288,http://data.gbif.org/ws/rest/occurrence/get?key=295147288
"National Museum of Nature and Science, Japan","Plant specimens depodited in Osaka Museum of Natural History, Japan.",,,,,,,OSA,C,OSA555,Specimen,,20:57.0,,,Maackia tashiroi (Yatabe) Makino,(Yatabe) Makino,Maackia tashiroi (Yatabe) Makino,Plantae,,,,Fabaceae,Maackia,Japan,Japan,,,,Okinawa Prefecture,Eastern Asia,Japan,,,,,,,,,,,,http://data.gbif.org/occurrences/295146929,http://data.gbif.org/ws/rest/occurrence/get?key=295146929
Royal Botanic Garden Edinburgh,RBGE Herbarium (E),Copyright Royal Botanic Garden Edinburgh. Contact us for rights to commercial use.,,,,,,E,E,E00105058,Specimen,,07:00.0,,,Maackia tashiroi (Yatabe) Makino,,Maackia tashiroi (Yatabe) Makino,,,,,Leguminosae,Maackia,JP,Japan,,,,,Eastern Asia,,,,,,,,,,,,,http://data.gbif.org/occurrences/575327543,http://data.gbif.org/ws/rest/occurrence/get?key=575327543
"National Museum of Nature and Science, Japan","Plant specimens depodited in Osaka Museum of Natural History, Japan.",,,,,,,OSA,C,OSA23059,Specimen,,20:58.0,,,Maackia tashiroi Makino,Makino,Maackia tashiroi Makino,Plantae,,,,Fabaceae,Maackia,Japan,Japan,Yakushima Island,,,Kagoshima Prefecture,Eastern Asia,Japan,,,,,,,,,,,,http://data.gbif.org/occurrences/295147058,http://data.gbif.org/ws/rest/occurrence/get?key=295147058
"National Museum of Nature and Science, Japan","Plant specimens depodited in Osaka Museum of Natural History, Japan.",,,,,,,OSA,C,OSA24686,Specimen,,20:58.0,,,Maackia tashiroi Makino,Makino,Maackia tashiroi Makino,Plantae,,,,Fabaceae,Maackia,Japan,Japan,Okinoerabu-jima Island,,,Kagoshima Prefecture,Eastern Asia,Japan,,,,,,,,,,,,http://data.gbif.org/occurrences/295147080,http://data.gbif.org/ws/rest/occurrence/get?key=295147080
