Data Publisher,Dataset,Dataset Rights,Collector name,Collector number,Field number,GUID,Date collected,Institution code,Collection code,Catalogue number,Basis of record,Image url,Last indexed,Identifier,Identification date,Scientific name,Author,Scientific name (interpreted),Kingdom,Phylum,Class,Order,Family,Genus,Country,Country (interpreted),Locality,County,Continent or Ocean,State/Province,Region,Publisher country,Latitude,Longitude,Coordinate precision,Cell id,Centi cell id,Min depth,Max depth,Max depth,Min altitude,Max altitude,Altitude precision,GBIF portal url,GBIF webservice url
"National Museum of Nature and Science, Japan",Angiosperm specimens of Iwate Prefectural Museum,,,,,,,IPMM,PA,29664,Specimen,,00:25.0,,,Viola tricolor L.,L.,Viola tricolor L.,Plantae,Angiospermae,Dicotyledoneae,Violales,Violaceae,Viola,Japan,Japan,,Morioka-shi,,Iwate,Eastern Asia,Japan,,,,,,,,,,,,http://data.gbif.org/occurrences/204237284,http://data.gbif.org/ws/rest/occurrence/get?key=204237284
"National Museum of Nature and Science, Japan",Angiosperm specimens of Iwate Prefectural Museum,,,,,,,IPMM,PA,29665,Specimen,,00:25.0,,,Viola tricolor L.,L.,Viola tricolor L.,Plantae,Angiospermae,Dicotyledoneae,Violales,Violaceae,Viola,Japan,Japan,,Hanamaki-shi,,Iwate,Eastern Asia,Japan,,,,,,,,,,,,http://data.gbif.org/occurrences/204237285,http://data.gbif.org/ws/rest/occurrence/get?key=204237285
"National Museum of Nature and Science, Japan","Botanical specimens database of Mr. Jiro Ito collection, Shizuoka Prefecture Museum of Natural History",,,,,,,SPMN,a,SPMN-a-1131,Specimen,,37:48.0,,,Viola tricolor L.,L.,Viola tricolor L.,Plantae,Magnoliophyta,Magnoliopsida,Violales,Violaceae,Viola,Japan,Japan,,Shizuoka-shi,,Shizuoka,Eastern Asia,Japan,,,,,,,,,,,,http://data.gbif.org/occurrences/380184682,http://data.gbif.org/ws/rest/occurrence/get?key=380184682
"National Museum of Nature and Science, Japan","Gunma Museum of Natural History, Vascular Plant Specimen",,,,,,,GMNHJ,Plant,BS0011918,Specimen,,36:04.0,,,Viola tricolor L.,L.,Viola tricolor L.,Plantae,Spermatophyta,Dicotyledoneae,,Violaceae,Viola,Japan,Japan,"Side of Pond Morinji-numa,Horikucho",Tatebayashi-shi,,Gunma,Eastern Asia,Japan,36.2247,139.533,,45679,25,,,,20,20,,http://data.gbif.org/occurrences/234497063,http://data.gbif.org/ws/rest/occurrence/get?key=234497063
"National Museum of Nature and Science, Japan",Plant Specimens of Kurashiki Museum of Natural History,,,,,,,KURA,KURA,kt111523,Specimen,,19:48.0,,,Viola tricolor L.,L.,Viola tricolor L.,Plantae,,,Violales,Violaceae,Viola,Japan,Japan,,Osafune-cho,,Okayama,Eastern Asia,Japan,,,,,,,,,,,,http://data.gbif.org/occurrences/204297591,http://data.gbif.org/ws/rest/occurrence/get?key=204297591
"National Museum of Nature and Science, Japan",Plant Specimens of Kurashiki Museum of Natural History,,,,,,,KURA,KURA,kt160285,Specimen,,19:49.0,,,Viola tricolor L.,L.,Viola tricolor L.,Plantae,,,Violales,Violaceae,Viola,Japan,Japan,,Seto-cho,,Okayama,Eastern Asia,Japan,,,,,,,,,,,,http://data.gbif.org/occurrences/204297732,http://data.gbif.org/ws/rest/occurrence/get?key=204297732
"National Museum of Nature and Science, Japan",Plant Specimens of Kurashiki Museum of Natural History,,,,,,,KURA,KURA,kt117058,Specimen,,19:48.0,,,Viola tricolor L.,L.,Viola tricolor L.,Plantae,,,Violales,Violaceae,Viola,Japan,Japan,,Tamano-shi,,Okayama,Eastern Asia,Japan,,,,,,,,,,,,http://data.gbif.org/occurrences/204297331,http://data.gbif.org/ws/rest/occurrence/get?key=204297331
"National Museum of Nature and Science, Japan",Plant Specimens of Kurashiki Museum of Natural History,,,,,,,KURA,KURA,123299,Specimen,,19:46.0,,,Viola tricolor L.,L.,Viola tricolor L.,Plantae,,,,Violaceae,Viola,Japan,Japan,,,,Okayama,Eastern Asia,Japan,,,,,,,,,,,,http://data.gbif.org/occurrences/43189242,http://data.gbif.org/ws/rest/occurrence/get?key=43189242
"National Museum of Nature and Science, Japan",Plant Specimens of Kurashiki Museum of Natural History,,,,,,,KURA,KURA,8821,Specimen,,19:47.0,,,Viola tricolor L.,,Viola tricolor L.,Plantae,,,Violales,Violaceae,Viola,Japan,Japan,Kojimashionasu,Kurashiki City,,Okayama Prefecture,Eastern Asia,Japan,,,,,,,,,,,,http://data.gbif.org/occurrences/148849136,http://data.gbif.org/ws/rest/occurrence/get?key=148849136
"National Museum of Nature and Science, Japan",Plant Specimens of Kurashiki Museum of Natural History,,,,,,,KURA,KURA,kt96229,Specimen,,19:49.0,,,Viola tricolor L.,L.,Viola tricolor L.,Plantae,,,Violales,Violaceae,Viola,Japan,Japan,,Kumayama-cho,,Okayama,Eastern Asia,Japan,,,,,,,,,,,,http://data.gbif.org/occurrences/204297704,http://data.gbif.org/ws/rest/occurrence/get?key=204297704
"National Museum of Nature and Science, Japan",Plant Specimens of Kurashiki Museum of Natural History,,,,,,,KURA,KURA,39001,Specimen,,19:47.0,,,Viola tricolor L.,,Viola tricolor L.,Plantae,,,Violales,Violaceae,Viola,Japan,Japan,Shinogose,Okayama City,,Okayama Prefecture,Eastern Asia,Japan,,,,,,,,,,,,http://data.gbif.org/occurrences/148849339,http://data.gbif.org/ws/rest/occurrence/get?key=148849339
"National Museum of Nature and Science, Japan",Plant Specimens of Kurashiki Museum of Natural History,,,,,,,KURA,KURA,123298,Specimen,,19:46.0,,,Viola tricolor L.,L.,Viola tricolor L.,Plantae,,,,Violaceae,Viola,Japan,Japan,,,,Aichi,Eastern Asia,Japan,,,,,,,,,,,,http://data.gbif.org/occurrences/43189246,http://data.gbif.org/ws/rest/occurrence/get?key=43189246
"National Museum of Nature and Science, Japan",Plant Specimens of Kurashiki Museum of Natural History,,,,,,,KURA,KURA,46032,Specimen,,19:47.0,,,Viola tricolor L.,,Viola tricolor L.,Plantae,,,Violales,Violaceae,Viola,Japan,Japan,Inujima Isl.,Okayama City,,Okayama Prefecture,Eastern Asia,Japan,,,,,,,,,,,,http://data.gbif.org/occurrences/148849356,http://data.gbif.org/ws/rest/occurrence/get?key=148849356
"National Museum of Nature and Science, Japan",Plant Specimens of Kurashiki Museum of Natural History,,,,,,,KURA,KURA,kt96549,Specimen,,19:47.0,,,Viola tricolor L.,L.,Viola tricolor L.,Plantae,,,Violales,Violaceae,Viola,Japan,Japan,,Funao-cho,,Okayama,Eastern Asia,Japan,,,,,,,,,,,,http://data.gbif.org/occurrences/204297276,http://data.gbif.org/ws/rest/occurrence/get?key=204297276
"National Museum of Nature and Science, Japan",Plant Specimens of Kurashiki Museum of Natural History,,,,,,,KURA,KURA,kt152786,Specimen,,19:48.0,,,Viola tricolor L.,L.,Viola tricolor L.,Plantae,,,Violales,Violaceae,Viola,Japan,Japan,,Setouchi-shi,,Okayama,Eastern Asia,Japan,,,,,,,,,,,,http://data.gbif.org/occurrences/204297603,http://data.gbif.org/ws/rest/occurrence/get?key=204297603
"National Museum of Nature and Science, Japan",Plant Specimens of Kurashiki Museum of Natural History,,,,,,,KURA,KURA,kt160505,Specimen,,19:48.0,,,Viola tricolor L.,L.,Viola tricolor L.,Plantae,,,Violales,Violaceae,Viola,Japan,Japan,,Setouchi-shi,,Okayama,Eastern Asia,Japan,,,,,,,,,,,,http://data.gbif.org/occurrences/204297616,http://data.gbif.org/ws/rest/occurrence/get?key=204297616
"National Museum of Nature and Science, Japan",Plant Specimens of Kurashiki Museum of Natural History,,,,,,,KURA,KURA,169305,Specimen,,19:50.0,,,Viola tricolor L.,L.,Viola tricolor L.,Plantae,,,Violales,Violaceae,Viola,Japan,Japan,,Kasaoka-shi,,Okayama,Eastern Asia,Japan,,,,,,,,,,,,http://data.gbif.org/occurrences/395812742,http://data.gbif.org/ws/rest/occurrence/get?key=395812742
"National Museum of Nature and Science, Japan",Plant Specimens of Kurashiki Museum of Natural History,,,,,,,KURA,KURA,39364,Specimen,,19:47.0,,,Viola tricolor L.,,Viola tricolor L.,Plantae,,,Violales,Violaceae,Viola,Japan,Japan,Tsushimanaka,Okayama City,,Okayama Prefecture,Eastern Asia,Japan,,,,,,,,,,,,http://data.gbif.org/occurrences/148849342,http://data.gbif.org/ws/rest/occurrence/get?key=148849342
"National Museum of Nature and Science, Japan",Plant Specimens of Kurashiki Museum of Natural History,,,,,,,KURA,KURA,kt112090,Specimen,,19:48.0,,,Viola tricolor L.,L.,Viola tricolor L.,Plantae,,,Violales,Violaceae,Viola,Japan,Japan,,Bizen-shi,,Okayama,Eastern Asia,Japan,,,,,,,,,,,,http://data.gbif.org/occurrences/204297635,http://data.gbif.org/ws/rest/occurrence/get?key=204297635
"National Museum of Nature and Science, Japan",Plant Specimens of Kurashiki Museum of Natural History,,,,,,,KURA,KURA,kt83050,Specimen,,19:48.0,,,Viola tricolor L.,L.,Viola tricolor L.,Plantae,,,Violales,Violaceae,Viola,Japan,Japan,,Kiyone-son,,Okayama,Eastern Asia,Japan,,,,,,,,,,,,http://data.gbif.org/occurrences/204297511,http://data.gbif.org/ws/rest/occurrence/get?key=204297511
"National Museum of Nature and Science, Japan",Plant Specimens of Kurashiki Museum of Natural History,,,,,,,KURA,KURA,169231,Specimen,,19:50.0,,,Viola tricolor L.,L.,Viola tricolor L.,Plantae,,,Violales,Violaceae,Viola,Japan,Japan,,Okayama-shi,,Okayama,Eastern Asia,Japan,,,,,,,,,,,,http://data.gbif.org/occurrences/395812735,http://data.gbif.org/ws/rest/occurrence/get?key=395812735
"National Museum of Nature and Science, Japan",Plant Specimens of Kurashiki Museum of Natural History,,,,,,,KURA,KURA,9218,Specimen,,19:49.0,,,Viola tricolor L.,L.,Viola tricolor L.,Plantae,,,Violales,Violaceae,Viola,Japan,Japan,,Niimi-shi,,Okayama,Eastern Asia,Japan,,,,,,,,,,,,http://data.gbif.org/occurrences/395812321,http://data.gbif.org/ws/rest/occurrence/get?key=395812321
"National Museum of Nature and Science, Japan",Plant Specimens of Kurashiki Museum of Natural History,,,,,,,KURA,KURA,165161,Specimen,,19:50.0,,,Viola tricolor L.,L.,Viola tricolor L.,Plantae,,,Violales,Violaceae,Viola,Japan,Japan,,Okayama-shi,,Okayama,Eastern Asia,Japan,,,,,,,,,,,,http://data.gbif.org/occurrences/395812713,http://data.gbif.org/ws/rest/occurrence/get?key=395812713
"National Museum of Nature and Science, Japan",Plant Specimens of Kurashiki Museum of Natural History,,,,,,,KURA,KURA,kt118764,Specimen,,19:48.0,,,Viola tricolor L.,L.,Viola tricolor L.,Plantae,,,Violales,Violaceae,Viola,Japan,Japan,,Takahashi-shi,,Okayama,Eastern Asia,Japan,,,,,,,,,,,,http://data.gbif.org/occurrences/204297372,http://data.gbif.org/ws/rest/occurrence/get?key=204297372
"National Museum of Nature and Science, Japan",Vascular plants collection of Hiratsuka City Museum,,,,,,,HCM,56,10800,Specimen,,16:59.0,,,Viola tricolor L.,L.,Viola tricolor L.,Plantae,Angiospermae,Dicotyledoneae,,Violaceae,Viola,Japan,Japan,,Isehara-shi,,Kanagawa,Eastern Asia,Japan,,,,,,,,,,,,http://data.gbif.org/occurrences/295336207,http://data.gbif.org/ws/rest/occurrence/get?key=295336207
"National Museum of Nature and Science, Japan",Vascular plants collection of Hiratsuka City Museum,,,,,,,HCM,56,82136,Specimen,,17:01.0,,,Viola tricolor L.,L.,Viola tricolor L.,Plantae,,,,Violaceae,Viola,Japan,Japan,,Hadano-shi,,Kanagawa,Eastern Asia,Japan,,,,,,,,,,,,http://data.gbif.org/occurrences/385743303,http://data.gbif.org/ws/rest/occurrence/get?key=385743303
"National Museum of Nature and Science, Japan",Vascular plants collection of Hiratsuka City Museum,,,,,,,HCM,56,10804,Specimen,,17:00.0,,,Viola tricolor L.,L.,Viola tricolor L.,Plantae,Angiospermae,Dicotyledoneae,,Violaceae,Viola,Japan,Japan,,Hiratsuka-shi,,Kanagawa,Eastern Asia,Japan,,,,,,,,,,,,http://data.gbif.org/occurrences/295336211,http://data.gbif.org/ws/rest/occurrence/get?key=295336211
"National Museum of Nature and Science, Japan",Vascular plants collection of Hiratsuka City Museum,,,,,,,HCM,56,10801,Specimen,,16:59.0,,,Viola tricolor L.,L.,Viola tricolor L.,Plantae,Angiospermae,Dicotyledoneae,,Violaceae,Viola,Japan,Japan,,Hadano-shi,,Kanagawa,Eastern Asia,Japan,,,,,,,,,,,,http://data.gbif.org/occurrences/295336208,http://data.gbif.org/ws/rest/occurrence/get?key=295336208
"National Museum of Nature and Science, Japan",Vascular plants collection of Hiratsuka City Museum,,,,,,,HCM,56,74980,Specimen,,17:00.0,,,Viola tricolor L.,L.,Viola tricolor L.,Plantae,,,,Violaceae,Viola,Japan,Japan,,Hadano-shi,,Kanagawa,Eastern Asia,Japan,,,,,,,,,,,,http://data.gbif.org/occurrences/385743009,http://data.gbif.org/ws/rest/occurrence/get?key=385743009
"National Museum of Nature and Science, Japan",Vascular plants collection of Hiratsuka City Museum,,,,,,,HCM,56,10806,Specimen,,17:00.0,,,Viola tricolor L.,L.,Viola tricolor L.,Plantae,Angiospermae,Dicotyledoneae,,Violaceae,Viola,Japan,Japan,,Chigasaki-shi,,Kanagawa,Eastern Asia,Japan,,,,,,,,,,,,http://data.gbif.org/occurrences/295336213,http://data.gbif.org/ws/rest/occurrence/get?key=295336213
"National Museum of Nature and Science, Japan",Vascular plants collection of Hiratsuka City Museum,,,,,,,HCM,56,10802,Specimen,,16:59.0,,,Viola tricolor L.,L.,Viola tricolor L.,Plantae,Angiospermae,Dicotyledoneae,,Violaceae,Viola,Japan,Japan,,Ashigarakami-gun Oimachi,,Kanagawa,Eastern Asia,Japan,,,,,,,,,,,,http://data.gbif.org/occurrences/295336209,http://data.gbif.org/ws/rest/occurrence/get?key=295336209
"National Museum of Nature and Science, Japan",Vascular plants collection of Hiratsuka City Museum,,,,,,,HCM,56,75645,Specimen,,17:01.0,,,Viola tricolor L.,L.,Viola tricolor L.,Plantae,,,,Violaceae,Viola,Japan,Japan,,Hadano-shi,,Kanagawa,Eastern Asia,Japan,,,,,,,,,,,,http://data.gbif.org/occurrences/385743100,http://data.gbif.org/ws/rest/occurrence/get?key=385743100
"National Museum of Nature and Science, Japan",Vascular plants collection of Hiratsuka City Museum,,,,,,,HCM,56,10799,Specimen,,16:59.0,,,Viola tricolor L.,L.,Viola tricolor L.,Plantae,Angiospermae,Dicotyledoneae,,Violaceae,Viola,Japan,Japan,,Odawara-shi,,Kanagawa,Eastern Asia,Japan,,,,,,,,,,,,http://data.gbif.org/occurrences/295336206,http://data.gbif.org/ws/rest/occurrence/get?key=295336206
"National Museum of Nature and Science, Japan",Vascular plants collection of Hiratsuka City Museum,,,,,,,HCM,56,10805,Specimen,,17:00.0,,,Viola tricolor L.,L.,Viola tricolor L.,Plantae,Angiospermae,Dicotyledoneae,,Violaceae,Viola,Japan,Japan,,Fujisawa-shi,,Kanagawa,Eastern Asia,Japan,,,,,,,,,,,,http://data.gbif.org/occurrences/295336212,http://data.gbif.org/ws/rest/occurrence/get?key=295336212
"National Museum of Nature and Science, Japan",Vascular plants collection of Hiratsuka City Museum,,,,,,,HCM,56,15514,Specimen,,17:00.0,,,Viola tricolor L.,L.,Viola tricolor L.,Plantae,Angiospermae,Dicotyledoneae,,Violaceae,Viola,Japan,Japan,,Hiratsuka-shi,,Kanagawa,Eastern Asia,Japan,,,,,,,,,,,,http://data.gbif.org/occurrences/295336237,http://data.gbif.org/ws/rest/occurrence/get?key=295336237
"National Museum of Nature and Science, Japan",Vascular plants collection of Hiratsuka City Museum,,,,,,,HCM,56,75297,Specimen,,17:01.0,,,Viola tricolor L.,L.,Viola tricolor L.,Plantae,,,,Violaceae,Viola,Japan,Japan,,Naka-gun Oisomachi,,Kanagawa,Eastern Asia,Japan,,,,,,,,,,,,http://data.gbif.org/occurrences/385743069,http://data.gbif.org/ws/rest/occurrence/get?key=385743069
"National Museum of Nature and Science, Japan",Vascular plants collection of Hiratsuka City Museum,,,,,,,HCM,56,10807,Specimen,,17:00.0,,,Viola tricolor L.,L.,Viola tricolor L.,Plantae,Angiospermae,Dicotyledoneae,,Violaceae,Viola,Japan,Japan,,Odawara-shi,,Kanagawa,Eastern Asia,Japan,,,,,,,,,,,,http://data.gbif.org/occurrences/295336214,http://data.gbif.org/ws/rest/occurrence/get?key=295336214
"National Museum of Nature and Science, Japan",Vascular plants collection of Hiratsuka City Museum,,,,,,,HCM,56,75298,Specimen,,17:01.0,,,Viola tricolor L.,L.,Viola tricolor L.,Plantae,,,,Violaceae,Viola,Japan,Japan,,Ashigarakami-gun Nakai-machi,,Kanagawa,Eastern Asia,Japan,,,,,,,,,,,,http://data.gbif.org/occurrences/385743070,http://data.gbif.org/ws/rest/occurrence/get?key=385743070
"National Museum of Nature and Science, Japan",Vascular plants collection of Hiratsuka City Museum,,,,,,,HCM,56,81874,Specimen,,17:01.0,,,Viola tricolor L.,L.,Viola tricolor L.,Plantae,,,,Violaceae,Viola,Japan,Japan,,Naka-gun Ninomiyamachi,,Kanagawa,Eastern Asia,Japan,,,,,,,,,,,,http://data.gbif.org/occurrences/385743281,http://data.gbif.org/ws/rest/occurrence/get?key=385743281
"National Museum of Nature and Science, Japan",Vascular plants collection of Hiratsuka City Museum,,,,,,,HCM,56,10808,Specimen,,16:58.0,,,Viola tricolor L.,L.,Viola tricolor L.,Plantae,,,,VIOLACEAE,Viola,Japan,Japan,Kitakaname,Hiratsuka-shi,,Kanagawa,Eastern Asia,Japan,35.3625,139.281,,45319,32,,,,,,,http://data.gbif.org/occurrences/188252795,http://data.gbif.org/ws/rest/occurrence/get?key=188252795
"National Museum of Nature and Science, Japan",Vascular plants collection of Hiratsuka City Museum,,,,,,,HCM,56,10803,Specimen,,16:59.0,,,Viola tricolor L.,L.,Viola tricolor L.,Plantae,Angiospermae,Dicotyledoneae,,Violaceae,Viola,Japan,Japan,,Fujisawa-shi,,Kanagawa,Eastern Asia,Japan,,,,,,,,,,,,http://data.gbif.org/occurrences/295336210,http://data.gbif.org/ws/rest/occurrence/get?key=295336210
"National Museum of Nature and Science, Japan",Vascular plants collection of Hiratsuka City Museum,,,,,,,HCM,56,37545,Specimen,,17:00.0,,,Viola tricolor L.,L.,Viola tricolor L.,Plantae,Angiospermae,Dicotyledoneae,,Violaceae,Viola,Japan,Japan,,Isehara-shi,,Kanagawa,Eastern Asia,Japan,,,,,,,,,,,,http://data.gbif.org/occurrences/295336286,http://data.gbif.org/ws/rest/occurrence/get?key=295336286
"National Museum of Nature and Science, Japan",Vascular plants collection of Hiratsuka City Museum,,,,,,,HCM,56,10809,Specimen,,16:58.0,,,Viola tricolor L.,L.,Viola tricolor L.,Plantae,,,,VIOLACEAE,Viola,Japan,Japan,Ojiri,Hadano-shi,,Kanagawa,Eastern Asia,Japan,35.3625,139.231,,45319,32,,,,,,,http://data.gbif.org/occurrences/188252796,http://data.gbif.org/ws/rest/occurrence/get?key=188252796
