Data Publisher,Dataset,Dataset Rights,Collector name,Collector number,Field number,GUID,Date collected,Institution code,Collection code,Catalogue number,Basis of record,Image url,Last indexed,Identifier,Identification date,Scientific name,Author,Scientific name (interpreted),Kingdom,Phylum,Class,Order,Family,Genus,Country,Country (interpreted),Locality,County,Continent or Ocean,State/Province,Region,Publisher country,Latitude,Longitude,Coordinate precision,Cell id,Centi cell id,Min depth,Max depth,Max depth,Min altitude,Max altitude,Altitude precision,GBIF portal url,GBIF webservice url
"National Museum of Natural History, Smithsonian Institution",NMNH Botany Collections,See: http://www.mnh.si.edu/rc/db/2data_access_policy.html,S. Nakamine,,,,00:00.0,US,Botany,2618389,Specimen,,55:23.0,"Walker, E. H.",,Viburnum suspensum,Lindl.,Viburnum suspensum,Plantae,,Dicotyledonae,Dipsacales,Caprifoliaceae,Viburnum,Japan,Japan,Shuri City.,,Asia-Temperate,Okinawa Prefecture,Eastern Asia,United States,,,,,,,,,,,,http://data.gbif.org/occurrences/158081813,http://data.gbif.org/ws/rest/occurrence/get?key=158081813
"National Museum of Nature and Science, Japan","Plant specimens depodited in Osaka Museum of Natural History, Japan.",,,,,,,OSA,C,OSA639,Specimen,,25:23.0,,,Viburnum suspensum Lindl,Lindl,Viburnum suspensum Lindl,Plantae,,,,Caprifoliaceae,Viburnum,Japan,Japan,,,,Okinawa Prefecture,Eastern Asia,Japan,,,,,,,,,,,,http://data.gbif.org/occurrences/295178715,http://data.gbif.org/ws/rest/occurrence/get?key=295178715
"National Museum of Nature and Science, Japan","Herbarium Specimens of Tokushima Prefectural Museum, Japan",,,,,,,TKPM,B,SP140660,Specimen,,23:58.0,,,Viburnum suspensum Lindl.,Lindl.,Viburnum suspensum Lindl.,Plantae,Angiospermae,Dicotyledoneae,Angiospermae,Caprifoliaceae,Viburnum,Japan,Japan,,Nankoku City,,Kouchi Pref.,Eastern Asia,Japan,,,,,,,,,,,,http://data.gbif.org/occurrences/150152175,http://data.gbif.org/ws/rest/occurrence/get?key=150152175
"National Museum of Nature and Science, Japan","Herbarium Specimens of Tokushima Prefectural Museum, Japan",,,,,,,TKPM,B,SP014905,Specimen,,23:56.0,,,Viburnum suspensum Lindl.,Lindl.,Viburnum suspensum Lindl.,Plantae,Angiospermae,Dicotyledoneae,Angiospermae,Caprifoliaceae,Viburnum,Japan,Japan,,Tokushima City,,Tokushima Pref.,Eastern Asia,Japan,,,,,,,,,,,,http://data.gbif.org/occurrences/150151725,http://data.gbif.org/ws/rest/occurrence/get?key=150151725
"National Museum of Nature and Science, Japan","Herbarium Specimens of Tokushima Prefectural Museum, Japan",,,,,,,TKPM,B,SP140659,Specimen,,23:58.0,,,Viburnum suspensum Lindl.,Lindl.,Viburnum suspensum Lindl.,Plantae,Angiospermae,Dicotyledoneae,Angiospermae,Caprifoliaceae,Viburnum,Japan,Japan,,Tokushima City,,Tokushima Pref.,Eastern Asia,Japan,,,,,,,,,,,,http://data.gbif.org/occurrences/150152174,http://data.gbif.org/ws/rest/occurrence/get?key=150152174
"National Institute of Genetics, ROIS","Plant Specimen Database of Tama Forest Science Garden, Forestry and Forest Products Research Institute, Japan",,,,,,,FFPRI,TFA,30202,Specimen,,25:38.0,,,Viburnum suspensum Lindl.,,Viburnum suspensum Lindl.,Plantae,Magnoliophyta,Magnoliopsida,Dipsacales,Caprifoliaceae,Viburnum,Japan,Japan,,,,Kagosima Prefecture,Eastern Asia,Japan,,,,,,,,,,,,http://data.gbif.org/occurrences/360273506,http://data.gbif.org/ws/rest/occurrence/get?key=360273506
"National Institute of Genetics, ROIS","Plant Specimen Database of Tama Forest Science Garden, Forestry and Forest Products Research Institute, Japan",,,,,,,FFPRI,TFA,30201,Specimen,,25:38.0,,,Viburnum suspensum Lindl.,,Viburnum suspensum Lindl.,Plantae,Magnoliophyta,Magnoliopsida,Dipsacales,Caprifoliaceae,Viburnum,Japan,Japan,,,,Hukuoka Prefecture,Eastern Asia,Japan,,,,,,,,,,,,http://data.gbif.org/occurrences/360273505,http://data.gbif.org/ws/rest/occurrence/get?key=360273505
"National Museum of Nature and Science, Japan",Plant Specimens of Kurashiki Museum of Natural History,,,,,,,KURA,KURA,63344,Specimen,,19:38.0,,,Viburnum suspensum Lindl.,Lindl.,Viburnum suspensum Lindl.,Plantae,,,,Caprifoliaceae,Viburnum,Japan,Japan,,,,Okayama,Eastern Asia,Japan,,,,,,,,,,,,http://data.gbif.org/occurrences/43185717,http://data.gbif.org/ws/rest/occurrence/get?key=43185717
"National Museum of Nature and Science, Japan",Plant Specimens of Kurashiki Museum of Natural History,,,,,,,KURA,KURA,63346,Specimen,,19:38.0,,,Viburnum suspensum Lindl.,Lindl.,Viburnum suspensum Lindl.,Plantae,,,,Caprifoliaceae,Viburnum,Japan,Japan,,,,Okayama,Eastern Asia,Japan,,,,,,,,,,,,http://data.gbif.org/occurrences/43185718,http://data.gbif.org/ws/rest/occurrence/get?key=43185718
"National Museum of Nature and Science, Japan",Plant Specimens of Kurashiki Museum of Natural History,,,,,,,KURA,KURA,63347,Specimen,,19:38.0,,,Viburnum suspensum Lindl.,Lindl.,Viburnum suspensum Lindl.,Plantae,,,,Caprifoliaceae,Viburnum,Japan,Japan,,,,Okayama,Eastern Asia,Japan,,,,,,,,,,,,http://data.gbif.org/occurrences/43185719,http://data.gbif.org/ws/rest/occurrence/get?key=43185719
"National Museum of Nature and Science, Japan",Plant Specimens of Kurashiki Museum of Natural History,,,,,,,KURA,KURA,63345,Specimen,,19:38.0,,,Viburnum suspensum Lindl.,Lindl.,Viburnum suspensum Lindl.,Plantae,,,,Caprifoliaceae,Viburnum,Japan,Japan,,,,Kagashima,Eastern Asia,Japan,,,,,,,,,,,,http://data.gbif.org/occurrences/43185722,http://data.gbif.org/ws/rest/occurrence/get?key=43185722
"National Museum of Nature and Science, Japan",Plant Specimens of Kurashiki Museum of Natural History,,,,,,,KURA,KURA,63348,Specimen,,19:38.0,,,Viburnum suspensum Lindl.,Lindl.,Viburnum suspensum Lindl.,Plantae,,,,Caprifoliaceae,Viburnum,Japan,Japan,,,,Kagawa,Eastern Asia,Japan,,,,,,,,,,,,http://data.gbif.org/occurrences/43185721,http://data.gbif.org/ws/rest/occurrence/get?key=43185721
"National Museum of Nature and Science, Japan","Plant specimens depodited in Osaka Museum of Natural History, Japan.",,,,,,,OSA,C,OSA80820,Specimen,,25:26.0,,,Viburnum suspensum Lindl.,,Viburnum suspensum Lindl.,Plantae,,,,Caprifoliaceae,Viburnum,Japan,Japan,Amami-Ohshima Island,Kasari-cho,,Kagoshima,Eastern Asia,Japan,,,,,,,,,,,,http://data.gbif.org/occurrences/295179313,http://data.gbif.org/ws/rest/occurrence/get?key=295179313
"National Museum of Nature and Science, Japan","Plant specimens depodited in Osaka Museum of Natural History, Japan.",,,,,,,OSA,C,OSA49691,Specimen,,25:25.0,,,Viburnum suspensum Lindl.,Lindl.,Viburnum suspensum Lindl.,Plantae,,,,Caprifoliaceae,Viburnum,Japan,Japan,Amami-Ohshima Island,,,Kagoshima Prefecture,Eastern Asia,Japan,,,,,,,,,,,,http://data.gbif.org/occurrences/295179090,http://data.gbif.org/ws/rest/occurrence/get?key=295179090
"National Museum of Nature and Science, Japan","Plant specimens depodited in Osaka Museum of Natural History, Japan.",,,,,,,OSA,C,OSA67055,Specimen,,25:25.0,,,Viburnum suspensum Lindl.,Lindl.,Viburnum suspensum Lindl.,Plantae,,,,Caprifoliaceae,Viburnum,Japan,Japan,,Kurashiki-shi,,Okayama Prefecture,Eastern Asia,Japan,,,,,,,,,,,,http://data.gbif.org/occurrences/295179203,http://data.gbif.org/ws/rest/occurrence/get?key=295179203
"National Museum of Nature and Science, Japan","Plant specimens depodited in Osaka Museum of Natural History, Japan.",,,,,,,OSA,C,OSA39258,Specimen,,25:24.0,,,Viburnum suspensum Lindley,Lindley,Viburnum suspensum Lindley,Plantae,,,,Caprifoliaceae,Viburnum,Japan,Japan,Kikaijima Island,,,Kagoshima Prefecture,Eastern Asia,Japan,,,,,,,,,,,,http://data.gbif.org/occurrences/295179011,http://data.gbif.org/ws/rest/occurrence/get?key=295179011
"National Museum of Nature and Science, Japan","Plant specimens depodited in Osaka Museum of Natural History, Japan.",,,,,,,OSA,C,OSA44971,Specimen,,25:24.0,,,Viburnum suspensum Lindley,Lindley,Viburnum suspensum Lindley,Plantae,,,,Caprifoliaceae,Viburnum,Japan,Japan,,Nishinomiya-shi,,Hyogo Prefecture,Eastern Asia,Japan,,,,,,,,,,,,http://data.gbif.org/occurrences/295179059,http://data.gbif.org/ws/rest/occurrence/get?key=295179059
"National Museum of Nature and Science, Japan",Plant Specimens of The Shimane Nature Museum of Mt. Sanbe,,,,,,,SNMS,P,4097,Specimen,,46:15.0,,,Viburnum suspensum Lindley,Lindley,Viburnum suspensum Lindley,Plantae,,,Dipsacales,Caprifoliaceae,Viburnum,Japan,Japan,"Mt. Azuma, Omaki","Yokota-cho, Nita-gun",,Shimane Pref.,Eastern Asia,Japan,,,,,,,,,,,,http://data.gbif.org/occurrences/204400459,http://data.gbif.org/ws/rest/occurrence/get?key=204400459
"National Museum of Nature and Science, Japan",Plant Specimens of The Shimane Nature Museum of Mt. Sanbe,,,,,,,SNMS,P,952,Specimen,,46:14.0,,,Viburnum suspensum Lindley,,Viburnum suspensum Lindley,Plantae,,,Dipsacales,Caprifoliaceae,Viburnum,Japan,Japan,"Mt. Azuma, Omaki","Yokota-cho, Nita-gun",,Shimane Pref.,Eastern Asia,Japan,,,,,,,,,,,,http://data.gbif.org/occurrences/143956386,http://data.gbif.org/ws/rest/occurrence/get?key=143956386
"National Museum of Nature and Science, Japan",Plant Specimens of The Shimane Nature Museum of Mt. Sanbe,,,,,,,SNMS,P,4541,Specimen,,46:15.0,,,Viburnum suspensum Lindley,Lindley,Viburnum suspensum Lindley,Plantae,,,Dipsacales,Caprifoliaceae,Viburnum,Japan,Japan,"Mt. Sarumasa, Kamiai","Nita-cho, Nita-gun",,Shimane Pref.,Eastern Asia,Japan,,,,,,,,,,,,http://data.gbif.org/occurrences/204400472,http://data.gbif.org/ws/rest/occurrence/get?key=204400472
