Data Publisher,Dataset,Dataset Rights,Collector name,Collector number,Field number,GUID,Date collected,Institution code,Collection code,Catalogue number,Basis of record,Image url,Last indexed,Identifier,Identification date,Scientific name,Author,Scientific name (interpreted),Kingdom,Phylum,Class,Order,Family,Genus,Country,Country (interpreted),Locality,County,Continent or Ocean,State/Province,Region,Publisher country,Latitude,Longitude,Coordinate precision,Cell id,Centi cell id,Min depth,Max depth,Max depth,Min altitude,Max altitude,Altitude precision,GBIF portal url,GBIF webservice url
"National Museum of Nature and Science, Japan",Angiosperm specimens of Iwate Prefectural Museum,,,,,,,IPMM,PA,22817,Specimen,,59:51.0,,,Lunaria annua L.,L.,Lunaria annua L.,Plantae,Angiospermae,Dicotyledoneae,Papaverales,Cruciferae,Lunaria,Japan,Japan,,Iwate-gun Kuzumakimachi,,Iwate,Eastern Asia,Japan,,,,,,,,,,,,http://data.gbif.org/occurrences/204234118,http://data.gbif.org/ws/rest/occurrence/get?key=204234118
"National Museum of Nature and Science, Japan","Botanical specimens database of Mr. Jiro Ito collection, Shizuoka Prefecture Museum of Natural History",,,,,,,SPMN,a,SPMN-a-557,Specimen,,37:40.0,,,Lunaria annua L.,L.,Lunaria annua L.,Plantae,Magnoliophyta,Magnoliopsida,Brassicales,Brassicaceae,Lunaria,Japan,Japan,,Nishiyatsushiro-gun Ichikawadaimoncho,,Yamanashi,Eastern Asia,Japan,,,,,,,,,,,,http://data.gbif.org/occurrences/380182986,http://data.gbif.org/ws/rest/occurrence/get?key=380182986
"National Museum of Nature and Science, Japan","FKSE-Herbarium specimens of Faculty of Symbiotic Systems Science, Fukushima University, Japan",,,,,,,FKSE,Plant,8680,Specimen,,52:27.0,,,Lunaria annua L.,L.,Lunaria annua L.,Plantae,,,,BRASSICACEAE,Lunaria,Japan,Japan,Cultivated,,,,Eastern Asia,Japan,,,,,,,,,,,,http://data.gbif.org/occurrences/238095425,http://data.gbif.org/ws/rest/occurrence/get?key=238095425
"National Museum of Nature and Science, Japan","FKSE-Herbarium specimens of Faculty of Symbiotic Systems Science, Fukushima University, Japan",,,,,,,FKSE,Plant,8679,Specimen,,52:27.0,,,Lunaria annua L.,L.,Lunaria annua L.,Plantae,,,,BRASSICACEAE,Lunaria,Japan,Japan,Cultivated,,,,Eastern Asia,Japan,,,,,,,,,,,,http://data.gbif.org/occurrences/238095424,http://data.gbif.org/ws/rest/occurrence/get?key=238095424
"National Museum of Nature and Science, Japan","Herbarium Specimens of Tokushima Prefectural Museum, Japan",,,,,,,TKPM,B,SP033697,Specimen,,23:04.0,,,Lunaria annua L.,L.,Lunaria annua L.,Plantae,Angiospermae,Dicotyledoneae,Angiospermae,Cruciferae,Lunaria,Japan,Japan,,Kitajima-cho,,Tokushima Pref.,Eastern Asia,Japan,,,,,,,,,,,,http://data.gbif.org/occurrences/150141364,http://data.gbif.org/ws/rest/occurrence/get?key=150141364
"National Museum of Nature and Science, Japan","Ibaraki Nature Museum, Vascular Plants collection",,,,,,,INM,Va,50154,Specimen,,52:22.0,,,Lunaria annua L.,L.,Lunaria annua L.,Plantae,ANGIOSPERMAE,DICOTYLEDONEAE,,CRUCIFERAE,Lunaria,Japan,Japan,,Hachioji-shi,,Tokyo,Eastern Asia,Japan,,,,,,,,,,,,http://data.gbif.org/occurrences/381821110,http://data.gbif.org/ws/rest/occurrence/get?key=381821110
"National Museum of Nature and Science, Japan",Plant Specimens of Kurashiki Museum of Natural History,,,,,,,KURA,KURA,169285,Specimen,,16:08.0,,,Lunaria annua L.,L.,Lunaria annua L.,Plantae,,,Papaverales,Cruciferae,Lunaria,Japan,Japan,,Kasaoka-shi,,Okayama,Eastern Asia,Japan,,,,,,,,,,,,http://data.gbif.org/occurrences/395777344,http://data.gbif.org/ws/rest/occurrence/get?key=395777344
"National Museum of Nature and Science, Japan",Plant Specimens of Kurashiki Museum of Natural History,,,,,,,KURA,KURA,kt23597,Specimen,,16:06.0,,,Lunaria annua L.,L.,Lunaria annua L.,Plantae,,,Papaverales,Cruciferae,Lunaria,Japan,Japan,,Hinase-cho,,Okayama,Eastern Asia,Japan,,,,,,,,,,,,http://data.gbif.org/occurrences/204280385,http://data.gbif.org/ws/rest/occurrence/get?key=204280385
"National Museum of Nature and Science, Japan",Plant Specimens of Kurashiki Museum of Natural History,,,,,,,KURA,KURA,kt112752,Specimen,,16:06.0,,,Lunaria annua L.,L.,Lunaria annua L.,Plantae,,,Papaverales,Cruciferae,Lunaria,Japan,Japan,,Bizen-shi,,Okayama,Eastern Asia,Japan,,,,,,,,,,,,http://data.gbif.org/occurrences/204280363,http://data.gbif.org/ws/rest/occurrence/get?key=204280363
"National Museum of Nature and Science, Japan",Plant Specimens of Kurashiki Museum of Natural History,,,,,,,KURA,KURA,58321,Specimen,,16:05.0,,,Lunaria annua L.,,Lunaria annua L.,Plantae,,,Papaverales,Cruciferae,Lunaria,Japan,Japan,,Okayama City,,Okayama Prefecture,Eastern Asia,Japan,,,,,,,,,,,,http://data.gbif.org/occurrences/148842557,http://data.gbif.org/ws/rest/occurrence/get?key=148842557
"National Museum of Nature and Science, Japan","Plant specimens depodited in Osaka Museum of Natural History, Japan.",,,,,,,OSA,C,OSA48631,Specimen,,20:50.0,,,Lunaria annua L.,L.,Lunaria annua L.,Plantae,,,,Brassicaceae,Lunaria,Japan,Japan,cult.,Nara-shi,,Nara Prefecture,Eastern Asia,Japan,,,,,,,,,,,,http://data.gbif.org/occurrences/295146065,http://data.gbif.org/ws/rest/occurrence/get?key=295146065
"National Museum of Nature and Science, Japan","Plant specimens depodited in Osaka Museum of Natural History, Japan.",,,,,,,OSA,C,OSA39577,Specimen,,20:50.0,,,Lunaria annua L.,L.,Lunaria annua L.,Plantae,,,,Brassicaceae,Lunaria,Japan,Japan,"Aogakidai, cult.",Nara-shi,,Nara Prefecture,Eastern Asia,Japan,,,,,,,,,,,,http://data.gbif.org/occurrences/295146021,http://data.gbif.org/ws/rest/occurrence/get?key=295146021
"National Museum of Nature and Science, Japan",Vascular Plants Collection of Sagamihara City Museum,,,,,,,JSCM,VS,12468,Specimen,,43:19.0,,,Lunaria annua L.,L.,Lunaria annua L.,Plantae,Spermatophyta,,,CRUCIFERAE,Lunaria,Japan,Japan,,Zama-shi,,Kanagawa,Eastern Asia,Japan,,,,,,,,,,,,http://data.gbif.org/occurrences/351223184,http://data.gbif.org/ws/rest/occurrence/get?key=351223184
"National Museum of Nature and Science, Japan",Vascular plants database of Atugi City Museum,,,,,,,JACM,PL10851,JACM-PL10851,Specimen,,29:16.0,,,Lunaria annua L.,,Lunaria annua L.,Plantae,Angiospermae,,,Cruciferae,Lunaria,Japan,Japan,,Atsugi-shi,,Kanagawa,Eastern Asia,Japan,,,,,,,,,,,,http://data.gbif.org/occurrences/238037178,http://data.gbif.org/ws/rest/occurrence/get?key=238037178
"National Museum of Nature and Science, Japan",Vascular Plants Collection of Sagamihara City Museum,,,,,,,JSCM,VS,21945,Specimen,,43:20.0,,,Lunaria annua L.,L.,Lunaria annua L.,Plantae,Spermatophyta,,,CRUCIFERAE,Lunaria,Japan,Japan,,,,Nagano,Eastern Asia,Japan,,,,,,,,,,,,http://data.gbif.org/occurrences/351223567,http://data.gbif.org/ws/rest/occurrence/get?key=351223567
"National Museum of Nature and Science, Japan",Vascular Plant Specimen Database of Kanagawa Prefectural Museum of Natural History,,,,,,,KPM,NA,KPM-NA1102375,Specimen,,27:53.0,,,Lunaria annua L.,,Lunaria annua L.,Plantae,Angiospermae,Dicotyledoneae,,CRUCIFERAE,Lunaria,Japan,Japan,,Hadano-shi,,Kanagawa Prefecture,Eastern Asia,Japan,35.3741,139.178,,45319,31,,,,,,,http://data.gbif.org/occurrences/295918573,http://data.gbif.org/ws/rest/occurrence/get?key=295918573
"National Museum of Nature and Science, Japan",Vascular plant specimens of Akita Prefectural Museum,,,,,,,AKPM,vs,44364,Specimen,,41:07.0,,,Lunaria annua L.,L.,Lunaria annua L.,Plantae,Spermatophyta,Dicotyledoneae,,Brassicaceae,Lunaria,Japan,Japan,Niida,Akita-shi,,Akita,Eastern Asia,Japan,,,,,,,,,,,,http://data.gbif.org/occurrences/296215368,http://data.gbif.org/ws/rest/occurrence/get?key=296215368
"National Museum of Nature and Science, Japan","Ibaraki Nature Museum, Vascular Plants collection",,,,,,,INM,Va,47104,Specimen,,52:22.0,,,Lunaria annua Linn.,Linn.,Lunaria annua Linn.,Plantae,ANGIOSPERMAE,DICOTYLEDONEAE,,CRUCIFERAE,Lunaria,Japan,Japan,,Naka-gun Tokaimura,,Ibaraki,Eastern Asia,Japan,,,,,,,,,,,,http://data.gbif.org/occurrences/381821100,http://data.gbif.org/ws/rest/occurrence/get?key=381821100
"National Museum of Nature and Science, Japan","Ibaraki Nature Museum, Vascular Plants collection",,,,,,,INM,Va,47879,Specimen,,52:22.0,,,Lunaria annua Linn.,Linn.,Lunaria annua Linn.,Plantae,ANGIOSPERMAE,DICOTYLEDONEAE,,CRUCIFERAE,Lunaria,Japan,Japan,,Naka-gun Tokaimura,,Ibaraki,Eastern Asia,Japan,,,,,,,,,,,,http://data.gbif.org/occurrences/381821108,http://data.gbif.org/ws/rest/occurrence/get?key=381821108
