Data Publisher,Dataset,Dataset Rights,Collector name,Collector number,Field number,GUID,Date collected,Institution code,Collection code,Catalogue number,Basis of record,Image url,Last indexed,Identifier,Identification date,Scientific name,Author,Scientific name (interpreted),Kingdom,Phylum,Class,Order,Family,Genus,Country,Country (interpreted),Locality,County,Continent or Ocean,State/Province,Region,Publisher country,Latitude,Longitude,Coordinate precision,Cell id,Centi cell id,Min depth,Max depth,Max depth,Min altitude,Max altitude,Altitude precision,GBIF portal url,GBIF webservice url
"National Institute of Genetics, ROIS","Herbarium Specimens of Museum of Nature and Human Activities, Hyogo Pref., Japan",,,,,,,HYO,VP,C1-109288,Specimen,,26:40.0,,,Sisymbrium luteum,,Sisymbrium luteum,Plantae,Magnoliophyta,,,Cruciferae,Sisymbrium,Japan,Japan,"Pref. Nagano: Shimashimatani, Azumi-mura, Minamiazumi-gun.",,,Nagano,Eastern Asia,Japan,137.783,36.1833,,,,,,,800,900,,http://data.gbif.org/occurrences/323523702,http://data.gbif.org/ws/rest/occurrence/get?key=323523702
"National Institute of Genetics, ROIS","Herbarium Specimens of Museum of Nature and Human Activities, Hyogo Pref., Japan",,,,,,,HYO,VP,C1-167086,Specimen,,26:10.0,,,Sisymbrium luteum,,Sisymbrium luteum,Plantae,Magnoliophyta,,,Cruciferae,Sisymbrium,Japan,Japan,"Mt. Ibuki, Ibuki-cho, Higashi-asai-gun",,,Shiga,Eastern Asia,Japan,,,,,,,,,,,,http://data.gbif.org/occurrences/323520684,http://data.gbif.org/ws/rest/occurrence/get?key=323520684
"National Institute of Genetics, ROIS","Herbarium Specimens of Museum of Nature and Human Activities, Hyogo Pref., Japan",,,,,,,HYO,VP,C1-109278,Specimen,,26:40.0,,,Sisymbrium luteum,,Sisymbrium luteum,Plantae,Magnoliophyta,,,Cruciferae,Sisymbrium,Japan,Japan,"Pref. Nagano: Shimashimatani, Azumi-mura, Minamiazumi-gun.",,,Nagano,Eastern Asia,Japan,137.783,36.1833,,,,,,,800,900,,http://data.gbif.org/occurrences/323523700,http://data.gbif.org/ws/rest/occurrence/get?key=323523700
"National Institute of Genetics, ROIS","Herbarium Specimens of Museum of Nature and Human Activities, Hyogo Pref., Japan",,,,,,,HYO,VP,C1-109287,Specimen,,26:40.0,,,Sisymbrium luteum,,Sisymbrium luteum,Plantae,Magnoliophyta,,,Cruciferae,Sisymbrium,Japan,Japan,"Pref. Nagano: Shimashimatani, Azumi-mura, Minamiazumi-gun.",,,Nagano,Eastern Asia,Japan,137.783,36.1833,,,,,,,800,900,,http://data.gbif.org/occurrences/323523701,http://data.gbif.org/ws/rest/occurrence/get?key=323523701
"National Museum of Nature and Science, Japan","Ibaraki Nature Museum, Vascular Plants collection",,,,,,,INM,Va,41556,Specimen,,54:12.0,,,Sisymbrium luteum (Maxim.) O. E. Schulz,(Maxim.) O. E. Schulz,Sisymbrium luteum (Maxim.) O. E. Schulz,Plantae,ANGIOSPERMAE,DICOTYLEDONEAE,,BRASSICACEAE,Sisymbrium,Japan,Japan,,,,,Eastern Asia,Japan,,,,,,,,,,,,http://data.gbif.org/occurrences/381843208,http://data.gbif.org/ws/rest/occurrence/get?key=381843208
"National Museum of Nature and Science, Japan","Plant specimens depodited in Osaka Museum of Natural History, Japan.",,,,,,,OSA,C,OSA79134,Specimen,,24:28.0,,,Sisymbrium luteum (Maxim.) O. E. Schulz,,Sisymbrium luteum (Maxim.) O. E. Schulz,Plantae,,,,Brassicaceae,Sisymbrium,Japan,Japan,Akka,Shimohei-gun Iwaizumi-cho,,Iwate,Eastern Asia,Japan,,,,,,,,,,,,http://data.gbif.org/occurrences/295171804,http://data.gbif.org/ws/rest/occurrence/get?key=295171804
"National Museum of Nature and Science, Japan","Plant specimens depodited in Osaka Museum of Natural History, Japan.",,,,,,,OSA,C,OSA71684,Specimen,,24:27.0,,,Sisymbrium luteum (Maxim.) O. E. Schulz,,Sisymbrium luteum (Maxim.) O. E. Schulz,Plantae,,,,Brassicaceae,Sisymbrium,Japan,Japan,Around Mt. Hakamagoshi-yama,Higashichikuma-gun Hongomura,,Nagano,Eastern Asia,Japan,,,,,,,,,,,,http://data.gbif.org/occurrences/295171731,http://data.gbif.org/ws/rest/occurrence/get?key=295171731
"National Museum of Nature and Science, Japan","Plant specimens depodited in Osaka Museum of Natural History, Japan.",,,,,,,OSA,C,OSA39780,Specimen,,24:26.0,,,Sisymbrium luteum (Maxim.) O. E. Schulz,(Maxim.) O. E. Schulz,Sisymbrium luteum (Maxim.) O. E. Schulz,Plantae,,,,Brassicaceae,Sisymbrium,Japan,Japan,"Aogakidai, cult.",Nara-shi,,Nara Prefecture,Eastern Asia,Japan,,,,,,,,,,,,http://data.gbif.org/occurrences/295171473,http://data.gbif.org/ws/rest/occurrence/get?key=295171473
"National Museum of Nature and Science, Japan","Plant specimens depodited in Osaka Museum of Natural History, Japan.",,,,,,,OSA,C,OSA71908,Specimen,,24:27.0,,,Sisymbrium luteum (Maxim.) O. E. Schulz,,Sisymbrium luteum (Maxim.) O. E. Schulz,Plantae,,,,Brassicaceae,Sisymbrium,Japan,Japan,Todai,Kamiina-gun Hasemura,,Nagano,Eastern Asia,Japan,,,,,,,,,,,,http://data.gbif.org/occurrences/295171735,http://data.gbif.org/ws/rest/occurrence/get?key=295171735
"National Museum of Nature and Science, Japan","Plant specimens depodited in Osaka Museum of Natural History, Japan.",,,,,,,OSA,C,OSA37906,Specimen,,24:26.0,,,Sisymbrium luteum (Maxim.) O. E. Schulz,(Maxim.) O. E. Schulz,Sisymbrium luteum (Maxim.) O. E. Schulz,Plantae,,,,Brassicaceae,Sisymbrium,Japan,Japan,"Aogakidai, cult. From Tsushima, Nagasaki prefecture",Nara-shi,,Nara Prefecture,Eastern Asia,Japan,,,,,,,,,,,,http://data.gbif.org/occurrences/295171461,http://data.gbif.org/ws/rest/occurrence/get?key=295171461
"National Museum of Nature and Science, Japan",Plant Specimens of Lake Biwa Museum,,,,,,,LBM,LBM,1100051949,Specimen,,16:30.0,,,Sisymbrium luteum (Maxim.) O. E. Schulz,(Maxim.) O. E. Schulz,Sisymbrium luteum (Maxim.) O. E. Schulz,Plantae,,,,Cruciferae,Sisymbrium,Japan,Japan,,,,Shiga,Eastern Asia,Japan,,,,,,,,,,,,http://data.gbif.org/occurrences/93838322,http://data.gbif.org/ws/rest/occurrence/get?key=93838322
"National Museum of Nature and Science, Japan",Plant Specimens of Lake Biwa Museum,,,,,,,LBM,LBM,1100051950,Specimen,,16:30.0,,,Sisymbrium luteum (Maxim.) O. E. Schulz,(Maxim.) O. E. Schulz,Sisymbrium luteum (Maxim.) O. E. Schulz,Plantae,,,,Cruciferae,Sisymbrium,Japan,Japan,,,,Shiga,Eastern Asia,Japan,,,,,,,,,,,,http://data.gbif.org/occurrences/93838324,http://data.gbif.org/ws/rest/occurrence/get?key=93838324
"National Museum of Nature and Science, Japan","Plant specimens depodited in Osaka Museum of Natural History, Japan.",,,,,,,OSA,C,OSA71855,Specimen,,24:27.0,,,Sisymbrium luteum (Maxim.) O. E. Schulz.,,Sisymbrium luteum (Maxim.) O. E. Schulz.,Plantae,,,,Brassicaceae,Sisymbrium,Japan,Japan,Todai,Kamiina-gun Hasemura,,Nagano,Eastern Asia,Japan,,,,,,,,,,,,http://data.gbif.org/occurrences/295171734,http://data.gbif.org/ws/rest/occurrence/get?key=295171734
"National Museum of Nature and Science, Japan","Plant specimens depodited in Osaka Museum of Natural History, Japan.",,,,,,,OSA,C,OSA30921,Specimen,,24:26.0,,,Sisymbrium luteum (Maxim.) O. E. Schulz.,(Maxim.) O. E. Schulz.,Sisymbrium luteum (Maxim.) O. E. Schulz.,Plantae,,,,Brassicaceae,Sisymbrium,Japan,Japan,Tsushima Island,Itsukushima-cho,,Nagasaki Prefecture,Eastern Asia,Japan,,,,,,,,,,,,http://data.gbif.org/occurrences/295171402,http://data.gbif.org/ws/rest/occurrence/get?key=295171402
"National Museum of Nature and Science, Japan","Plant specimens depodited in Osaka Museum of Natural History, Japan.",,,,,,,OSA,C,OSA30922,Specimen,,24:26.0,,,Sisymbrium luteum (Maxim.) O. E. Schulz.,(Maxim.) O. E. Schulz.,Sisymbrium luteum (Maxim.) O. E. Schulz.,Plantae,,,,Brassicaceae,Sisymbrium,Japan,Japan,Tsushima Island,Itsukushima-cho,,Nagasaki Prefecture,Eastern Asia,Japan,,,,,,,,,,,,http://data.gbif.org/occurrences/295171403,http://data.gbif.org/ws/rest/occurrence/get?key=295171403
"National Museum of Nature and Science, Japan","Plant specimens depodited in Osaka Museum of Natural History, Japan.",,,,,,,OSA,C,OSA4196,Specimen,,24:25.0,,,Sisymbrium luteum (Maxim.) O. E.Schulz,(Maxim.) O. E.Schulz,Sisymbrium luteum (Maxim.) O. E.Schulz,Plantae,,,,Brassicaceae,Sisymbrium,Japan,Japan,Ichi-no-toge to Kitayama-goe pass,Yoshino-gun,,Nara Prefecture,Eastern Asia,Japan,,,,,,,,,,,,http://data.gbif.org/occurrences/295171185,http://data.gbif.org/ws/rest/occurrence/get?key=295171185
"National Museum of Nature and Science, Japan","Plant specimens depodited in Osaka Museum of Natural History, Japan.",,,,,,,OSA,OSA,4196,Specimen,,24:24.0,,,Sisymbrium luteum (Maxim.) O. E.Schulz,(Maxim.) O. E.Schulz,Sisymbrium luteum (Maxim.) O. E.Schulz,Plantae,,,,Cruciferae,Sisymbrium,Japan,Japan,,Yoshino-gun Kamikitayamamura,,Nara,Eastern Asia,Japan,34.4069,135.798,,44955,47,,,,,,,http://data.gbif.org/occurrences/204392218,http://data.gbif.org/ws/rest/occurrence/get?key=204392218
"National Museum of Nature and Science, Japan","Plant specimens depodited in Osaka Museum of Natural History, Japan.",,,,,,,OSA,OSA,168054,Specimen,,24:24.0,,,Sisymbrium luteum (Maxim.) O. E.Schulz,(Maxim.) O. E.Schulz,Sisymbrium luteum (Maxim.) O. E.Schulz,Plantae,,,,Cruciferae,Sisymbrium,Japan,Japan,,Yoshino-gun Tenkawamura,,Nara,Eastern Asia,Japan,34.4069,135.798,,44955,47,,,,,,,http://data.gbif.org/occurrences/204392219,http://data.gbif.org/ws/rest/occurrence/get?key=204392219
"National Museum of Nature and Science, Japan","Ibaraki Nature Museum, Vascular Plants collection",,,,,,,INM,Va,17208,Specimen,,54:11.0,,,Sisymbrium luteum (Maxim.) O.E. Schulz,(Maxim.) O.E. Schulz,Sisymbrium luteum (Maxim.) O.E. Schulz,Plantae,,,,CRUCIFERAE,Sisymbrium,Japan,Japan,,Kitasoma-gun Moriyamachi,,Ibaraki,Eastern Asia,Japan,,,,,,,,,10,,,http://data.gbif.org/occurrences/381843021,http://data.gbif.org/ws/rest/occurrence/get?key=381843021
"National Museum of Nature and Science, Japan","Ibaraki Nature Museum, Vascular Plants collection",,,,,,,INM,Va,17207,Specimen,,54:11.0,,,Sisymbrium luteum (Maxim.) O.E. Schulz,(Maxim.) O.E. Schulz,Sisymbrium luteum (Maxim.) O.E. Schulz,Plantae,,,,CRUCIFERAE,Sisymbrium,Japan,Japan,,Kitasoma-gun Moriyamachi,,Ibaraki,Eastern Asia,Japan,,,,,,,,,10,,,http://data.gbif.org/occurrences/381843020,http://data.gbif.org/ws/rest/occurrence/get?key=381843020
"National Museum of Nature and Science, Japan",Angiospermatatophytina Collection of Saitama Museum of Natural History,,,,,,,SMNH,As,9162,Specimen,,53:45.0,,,Sisymbrium luteum (Maxim.) O.E.Schulz,(Maxim.) O.E.Schulz,Sisymbrium luteum (Maxim.) O.E.Schulz,Plantae,Angiospermae,Dicotyledoneae,Papaverales,Cruciferae,Sisymbrium,Japan,Japan,Mt. Tenmaru-yama,Tano-gun Uenomura,,Gunma,Eastern Asia,Japan,,,,,,,,,,,,http://data.gbif.org/occurrences/393111000,http://data.gbif.org/ws/rest/occurrence/get?key=393111000
"National Museum of Nature and Science, Japan",Angiospermatatophytina Collection of Saitama Museum of Natural History,,,,,,,SMNH,As,9154,Specimen,,53:45.0,,,Sisymbrium luteum (Maxim.) O.E.Schulz,(Maxim.) O.E.Schulz,Sisymbrium luteum (Maxim.) O.E.Schulz,Plantae,Angiospermae,Dicotyledoneae,Papaverales,Cruciferae,Sisymbrium,Japan,Japan,Mt. Akakuna-yama,Tano-gun Manbamachi,,Gunma,Eastern Asia,Japan,,,,,,,,,,,,http://data.gbif.org/occurrences/393110992,http://data.gbif.org/ws/rest/occurrence/get?key=393110992
"National Museum of Nature and Science, Japan",Angiospermatatophytina Collection of Saitama Museum of Natural History,,,,,,,SMNH,As,9158,Specimen,,53:45.0,,,Sisymbrium luteum (Maxim.) O.E.Schulz,(Maxim.) O.E.Schulz,Sisymbrium luteum (Maxim.) O.E.Schulz,Plantae,Angiospermae,Dicotyledoneae,Papaverales,Cruciferae,Sisymbrium,Japan,Japan,Akazawa-dani valley,Chichibu-gun Otakimura,,Saitama,Eastern Asia,Japan,,,,,,,,,,,,http://data.gbif.org/occurrences/393110996,http://data.gbif.org/ws/rest/occurrence/get?key=393110996
"National Museum of Nature and Science, Japan",Angiospermatatophytina Collection of Saitama Museum of Natural History,,,,,,,SMNH,As,9159,Specimen,,53:45.0,,,Sisymbrium luteum (Maxim.) O.E.Schulz,(Maxim.) O.E.Schulz,Sisymbrium luteum (Maxim.) O.E.Schulz,Plantae,Angiospermae,Dicotyledoneae,Papaverales,Cruciferae,Sisymbrium,Japan,Japan,Mt. Tetemizu-yama,Chichibu-gun Oganomachi,,Saitama,Eastern Asia,Japan,,,,,,,,,,,,http://data.gbif.org/occurrences/393110997,http://data.gbif.org/ws/rest/occurrence/get?key=393110997
"National Museum of Nature and Science, Japan",Angiospermatatophytina Collection of Saitama Museum of Natural History,,,,,,,SMNH,As,22961,Specimen,,53:48.0,,,Sisymbrium luteum (Maxim.) O.E.Schulz,(Maxim.) O.E.Schulz,Sisymbrium luteum (Maxim.) O.E.Schulz,Plantae,Angiospermae,Dicotyledoneae,Papaverales,Cruciferae,Sisymbrium,Japan,Japan,Shirahone,Minamiazumi-gun Azumimura,,Nagano,Eastern Asia,Japan,,,,,,,,,,,,http://data.gbif.org/occurrences/393111817,http://data.gbif.org/ws/rest/occurrence/get?key=393111817
"National Museum of Nature and Science, Japan",Angiospermatatophytina Collection of Saitama Museum of Natural History,,,,,,,SMNH,As,1112,Specimen,,53:44.0,,,Sisymbrium luteum (Maxim.) O.E.Schulz,(Maxim.) O.E.Schulz,Sisymbrium luteum (Maxim.) O.E.Schulz,Plantae,Angiospermae,Dicotyledoneae,Papaverales,Cruciferae,Sisymbrium,Japan,Japan,,Tano-gun,,Gunma,Eastern Asia,Japan,,,,,,,,,,,,http://data.gbif.org/occurrences/353567474,http://data.gbif.org/ws/rest/occurrence/get?key=353567474
"National Museum of Nature and Science, Japan",Angiospermatatophytina Collection of Saitama Museum of Natural History,,,,,,,SMNH,As,9155,Specimen,,53:45.0,,,Sisymbrium luteum (Maxim.) O.E.Schulz,(Maxim.) O.E.Schulz,Sisymbrium luteum (Maxim.) O.E.Schulz,Plantae,Angiospermae,Dicotyledoneae,Papaverales,Cruciferae,Sisymbrium,Japan,Japan,Mt. Akakuna-yama,Tano-gun Manbamachi,,Gunma,Eastern Asia,Japan,,,,,,,,,,,,http://data.gbif.org/occurrences/393110993,http://data.gbif.org/ws/rest/occurrence/get?key=393110993
"National Museum of Nature and Science, Japan",Angiospermatatophytina Collection of Saitama Museum of Natural History,,,,,,,SMNH,As,9160,Specimen,,53:45.0,,,Sisymbrium luteum (Maxim.) O.E.Schulz,(Maxim.) O.E.Schulz,Sisymbrium luteum (Maxim.) O.E.Schulz,Plantae,Angiospermae,Dicotyledoneae,Papaverales,Cruciferae,Sisymbrium,Japan,Japan,Mt. Tetemizu-yama,Chichibu-gun Oganomachi,,Saitama,Eastern Asia,Japan,,,,,,,,,,,,http://data.gbif.org/occurrences/393110998,http://data.gbif.org/ws/rest/occurrence/get?key=393110998
"National Museum of Nature and Science, Japan",Angiospermatatophytina Collection of Saitama Museum of Natural History,,,,,,,SMNH,As,22962,Specimen,,53:48.0,,,Sisymbrium luteum (Maxim.) O.E.Schulz,(Maxim.) O.E.Schulz,Sisymbrium luteum (Maxim.) O.E.Schulz,Plantae,Angiospermae,Dicotyledoneae,Papaverales,Cruciferae,Sisymbrium,Japan,Japan,Mt. Kano-yama,Tano-gun Nakasatomura,,Gunma,Eastern Asia,Japan,,,,,,,,,,,,http://data.gbif.org/occurrences/393111818,http://data.gbif.org/ws/rest/occurrence/get?key=393111818
"National Museum of Nature and Science, Japan",Angiosperm specimens of Iwate Prefectural Museum,,,,,,,IPMM,PA,4739,Specimen,,00:16.0,,,Sisymbrium luteum (Maxim.) O.E.Schulz,(Maxim.) O.E.Schulz,Sisymbrium luteum (Maxim.) O.E.Schulz,Plantae,Angiospermae,Dicotyledoneae,Papaverales,Cruciferae,Sisymbrium,Japan,Japan,,Shimohei-gun Iwaizumicho,,Iwate,Eastern Asia,Japan,,,,,,,,,,,,http://data.gbif.org/occurrences/204236339,http://data.gbif.org/ws/rest/occurrence/get?key=204236339
"National Museum of Nature and Science, Japan",Angiospermatatophytina Collection of Saitama Museum of Natural History,,,,,,,SMNH,As,9161,Specimen,,53:45.0,,,Sisymbrium luteum (Maxim.) O.E.Schulz,(Maxim.) O.E.Schulz,Sisymbrium luteum (Maxim.) O.E.Schulz,Plantae,Angiospermae,Dicotyledoneae,Papaverales,Cruciferae,Sisymbrium,Japan,Japan,Azusashiraiwa of Mikuni-one ridge,Chichibu-gun Otakimura,,Saitama,Eastern Asia,Japan,,,,,,,,,,,,http://data.gbif.org/occurrences/393110999,http://data.gbif.org/ws/rest/occurrence/get?key=393110999
"National Museum of Nature and Science, Japan",Angiosperm specimens of Iwate Prefectural Museum,,,,,,,IPMM,PA,71233,Specimen,,00:13.0,,,Sisymbrium luteum (Maxim.) O.E.Schulz,(Maxim.) O.E.Schulz,Sisymbrium luteum (Maxim.) O.E.Schulz,Plantae,Angiospermae,Dicotyledoneae,,Cruciferae,Sisymbrium,Japan,Japan,,Kamaishi-shi,,Iwate,Eastern Asia,Japan,,,,,,,,,,,,http://data.gbif.org/occurrences/93894903,http://data.gbif.org/ws/rest/occurrence/get?key=93894903
"National Museum of Nature and Science, Japan",Angiospermatatophytina Collection of Saitama Museum of Natural History,,,,,,,SMNH,As,9157,Specimen,,53:45.0,,,Sisymbrium luteum (Maxim.) O.E.Schulz,(Maxim.) O.E.Schulz,Sisymbrium luteum (Maxim.) O.E.Schulz,Plantae,Angiospermae,Dicotyledoneae,Papaverales,Cruciferae,Sisymbrium,Japan,Japan,Akazawa-dani valley,Chichibu-gun Otakimura,,Saitama,Eastern Asia,Japan,,,,,,,,,,,,http://data.gbif.org/occurrences/393110995,http://data.gbif.org/ws/rest/occurrence/get?key=393110995
"National Museum of Nature and Science, Japan",Angiospermatatophytina Collection of Saitama Museum of Natural History,,,,,,,SMNH,As,9163,Specimen,,53:45.0,,,Sisymbrium luteum (Maxim.) O.E.Schulz,(Maxim.) O.E.Schulz,Sisymbrium luteum (Maxim.) O.E.Schulz,Plantae,Angiospermae,Dicotyledoneae,Papaverales,Cruciferae,Sisymbrium,Japan,Japan,Tatsuzawa,Chichibu-gun Minanomachi,,Saitama,Eastern Asia,Japan,,,,,,,,,,,,http://data.gbif.org/occurrences/393111001,http://data.gbif.org/ws/rest/occurrence/get?key=393111001
"National Museum of Nature and Science, Japan",Angiosperm specimens of Iwate Prefectural Museum,,,,,,,IPMM,PA,22824,Specimen,,00:16.0,,,Sisymbrium luteum (Maxim.) O.E.Schulz,(Maxim.) O.E.Schulz,Sisymbrium luteum (Maxim.) O.E.Schulz,Plantae,Angiospermae,Dicotyledoneae,Papaverales,Cruciferae,Sisymbrium,Japan,Japan,,Iwate-gun Kuzumakimachi,,Iwate,Eastern Asia,Japan,,,,,,,,,,,,http://data.gbif.org/occurrences/204236510,http://data.gbif.org/ws/rest/occurrence/get?key=204236510
"National Museum of Nature and Science, Japan",Angiospermatatophytina Collection of Saitama Museum of Natural History,,,,,,,SMNH,As,9156,Specimen,,53:45.0,,,Sisymbrium luteum (Maxim.) O.E.Schulz,(Maxim.) O.E.Schulz,Sisymbrium luteum (Maxim.) O.E.Schulz,Plantae,Angiospermae,Dicotyledoneae,Papaverales,Cruciferae,Sisymbrium,Japan,Japan,Akazawa-dani valley,Chichibu-gun Otakimura,,Saitama,Eastern Asia,Japan,,,,,,,,,,,,http://data.gbif.org/occurrences/393110994,http://data.gbif.org/ws/rest/occurrence/get?key=393110994
"National Museum of Nature and Science, Japan",Angiospermatatophytina Collection of Saitama Museum of Natural History,,,,,,,SMNH,As,9164,Specimen,,53:45.0,,,Sisymbrium luteum (Maxim.) O.E.Schulz,(Maxim.) O.E.Schulz,Sisymbrium luteum (Maxim.) O.E.Schulz,Plantae,Angiospermae,Dicotyledoneae,Papaverales,Cruciferae,Sisymbrium,Japan,Japan,Tatsuzawa,Chichibu-gun Minanomachi,,Saitama,Eastern Asia,Japan,,,,,,,,,,,,http://data.gbif.org/occurrences/393111002,http://data.gbif.org/ws/rest/occurrence/get?key=393111002
"National Museum of Nature and Science, Japan",Angiospermatatophytina Collection of Saitama Museum of Natural History,,,,,,,SMNH,As,1113,Specimen,,53:44.0,,,Sisymbrium luteum (Maxim.) O.E.Schulz,(Maxim.) O.E.Schulz,Sisymbrium luteum (Maxim.) O.E.Schulz,Plantae,Angiospermae,Dicotyledoneae,Papaverales,Cruciferae,Sisymbrium,Japan,Japan,,Chichibu-gun Otakimura,,Saitama,Eastern Asia,Japan,,,,,,,,,,,,http://data.gbif.org/occurrences/353567475,http://data.gbif.org/ws/rest/occurrence/get?key=353567475
"National Museum of Nature and Science, Japan",Angiosperm specimens of Iwate Prefectural Museum,,,,,,,IPMM,PA,71234,Specimen,,00:13.0,,,Sisymbrium luteum (Maxim.) O.E.Schulz,(Maxim.) O.E.Schulz,Sisymbrium luteum (Maxim.) O.E.Schulz,Plantae,Angiospermae,Dicotyledoneae,,Cruciferae,Sisymbrium,Japan,Japan,,Kamihei-gun Otsuchicho,,Iwate,Eastern Asia,Japan,,,,,,,,,,,,http://data.gbif.org/occurrences/93894898,http://data.gbif.org/ws/rest/occurrence/get?key=93894898
"National Museum of Nature and Science, Japan",Angiospermatatophytina Collection of Saitama Museum of Natural History,,,,,,,SMNH,As,1111,Specimen,,53:44.0,,,Sisymbrium luteum (Maxim.) O.E.Schulz,(Maxim.) O.E.Schulz,Sisymbrium luteum (Maxim.) O.E.Schulz,Plantae,Angiospermae,Dicotyledoneae,Papaverales,Cruciferae,Sisymbrium,Japan,Japan,,Tano-gun,,Gunma,Eastern Asia,Japan,,,,,,,,,,,,http://data.gbif.org/occurrences/353567473,http://data.gbif.org/ws/rest/occurrence/get?key=353567473
"National Museum of Nature and Science, Japan","Gunma Museum of Natural History, Vascular Plant Specimen",,,,,,,GMNHJ,Plant,BS0056872,Specimen,,35:49.0,,,Sisymbrium luteum (Maxim.) O.E.Schulz,(Maxim.) O.E.Schulz,Sisymbrium luteum (Maxim.) O.E.Schulz,Plantae,Spermatophyta,Dicotyledoneae,,Cruciferae,Sisymbrium,Japan,Japan,Hino,Fujioka-shi,,Gunma,Eastern Asia,Japan,36.1933,138.989,,45678,19,,,,,,,http://data.gbif.org/occurrences/234496367,http://data.gbif.org/ws/rest/occurrence/get?key=234496367
"National Museum of Nature and Science, Japan","Gunma Museum of Natural History, Vascular Plant Specimen",,,,,,,GMNHJ,plant,BS0037060,Specimen,,35:51.0,,,Sisymbrium luteum (Maxim.) O.E.Schulz,(Maxim.) O.E.Schulz,Sisymbrium luteum (Maxim.) O.E.Schulz,Plantae,Spermatophyta,Dicotyledoneae,,Cruciferae,Sisymbrium,Japan,Japan,"Tanigawa Stream,Tonemachi-Hiragawa",Numata-shi,,Gunma,Eastern Asia,Japan,,,,,,,,,720,720,,http://data.gbif.org/occurrences/394062047,http://data.gbif.org/ws/rest/occurrence/get?key=394062047
"National Museum of Nature and Science, Japan","Gunma Museum of Natural History, Vascular Plant Specimen",,,,,,,GMNHJ,Plant,BS0032474,Specimen,,35:48.0,,,Sisymbrium luteum (Maxim.) O.E.Schulz,(Maxim.) O.E.Schulz,Sisymbrium luteum (Maxim.) O.E.Schulz,Plantae,Spermatophyta,Dicotyledoneae,,Cruciferae,Sisymbrium,Japan,Japan,Omamacho-odaira,Midori-shi,,Gunma,Eastern Asia,Japan,36.4792,139.312,,45679,43,,,,,,,http://data.gbif.org/occurrences/234496045,http://data.gbif.org/ws/rest/occurrence/get?key=234496045
"National Museum of Nature and Science, Japan","Gunma Museum of Natural History, Vascular Plant Specimen",,,,,,,GMNHJ,plant,BS0052794,Specimen,,35:50.0,,,Sisymbrium luteum (Maxim.) O.E.Schulz,(Maxim.) O.E.Schulz,Sisymbrium luteum (Maxim.) O.E.Schulz,Plantae,Spermatophyta,Dicotyledoneae,,Brassicaceae,Sisymbrium,Japan,Japan,Nageshi Pass,Fujioka-shi,,Gunma,Eastern Asia,Japan,36.1514,138.928,,45678,19,,,,,,,http://data.gbif.org/occurrences/295237611,http://data.gbif.org/ws/rest/occurrence/get?key=295237611
"National Museum of Nature and Science, Japan","Gunma Museum of Natural History, Vascular Plant Specimen",,,,,,,GMNHJ,Plant,BS0033414,Specimen,,35:48.0,,,Sisymbrium luteum (Maxim.) O.E.Schulz,(Maxim.) O.E.Schulz,Sisymbrium luteum (Maxim.) O.E.Schulz,Plantae,Spermatophyta,Dicotyledoneae,,Cruciferae,Sisymbrium,Japan,Japan,Mt. Akaguna,,,Gunma,Eastern Asia,Japan,36.1439,138.843,,45678,18,,,,,,,http://data.gbif.org/occurrences/234496048,http://data.gbif.org/ws/rest/occurrence/get?key=234496048
"National Museum of Nature and Science, Japan","Gunma Museum of Natural History, Vascular Plant Specimen",,,,,,,GMNHJ,Plant,BS0060983,Specimen,,35:48.0,,,Sisymbrium luteum (Maxim.) O.E.Schulz,(Maxim.) O.E.Schulz,Sisymbrium luteum (Maxim.) O.E.Schulz,Plantae,Spermatophyta,Dicotyledoneae,,Cruciferae,Sisymbrium,Japan,Japan,Mt. Takamine,Komoro-shi,,Nagano,Eastern Asia,Japan,36.4014,138.457,,45678,44,,,,,,,http://data.gbif.org/occurrences/234496106,http://data.gbif.org/ws/rest/occurrence/get?key=234496106
"National Museum of Nature and Science, Japan","Gunma Museum of Natural History, Vascular Plant Specimen",,,,,,,GMNHJ,plant,BS0007610,Specimen,,35:47.0,,,Sisymbrium luteum (Maxim.) O.E.Schulz,,Sisymbrium luteum (Maxim.) O.E.Schulz,Plantae,Spermatophyta,,,Cruciferae,Sisymbrium,Japan,Japan,"Shimogo,Ogaya forestry road, Mt. Yotsumata",Kanra-gun Shimonitamachi,,Gunma,Eastern Asia,Japan,36.2067,138.737,,45678,27,,,,450,,,http://data.gbif.org/occurrences/188208604,http://data.gbif.org/ws/rest/occurrence/get?key=188208604