Data Publisher,Dataset,Dataset Rights,Collector name,Collector number,Field number,GUID,Date collected,Institution code,Collection code,Catalogue number,Basis of record,Image url,Last indexed,Identifier,Identification date,Scientific name,Author,Scientific name (interpreted),Kingdom,Phylum,Class,Order,Family,Genus,Country,Country (interpreted),Locality,County,Continent or Ocean,State/Province,Region,Publisher country,Latitude,Longitude,Coordinate precision,Cell id,Centi cell id,Min depth,Max depth,Max depth,Min altitude,Max altitude,Altitude precision,GBIF portal url,GBIF webservice url
"National Museum of Nature and Science, Japan","Ibaraki Nature Museum, Vascular Plants collection",,,,,,,INM,Va,136836,Specimen,,54:44.0,,,Tricyrtis macranthopsis Masam.,Masam.,Tricyrtis macranthopsis Masam.,Plantae,SPERMATOPHYTAANGIOSPERMAE,MONOCOTYLEDONEAE,,LILIACEAE,Tricyrtis,Japan,Japan,,Higashimuro-gun Nachikatsuuracho,,Wakayama,Eastern Asia,Japan,,,,,,,,,,,,http://data.gbif.org/occurrences/381849316,http://data.gbif.org/ws/rest/occurrence/get?key=381849316
"National Museum of Nature and Science, Japan",Kochi Prefectural Makino Botanical Garden,,,,,,,MBK,MBK,0003949-B,Specimen,,04:54.0,,,Tricyrtis macranthopsis Masam.,Masam.,Tricyrtis macranthopsis Masam.,Plantae,,,,Liliaceae,Tricyrtis,Japan,Japan,,Tanabe-shi,,Wakayama,Eastern Asia,Japan,,,,,,,,,,,,http://data.gbif.org/occurrences/354284598,http://data.gbif.org/ws/rest/occurrence/get?key=354284598
"National Museum of Nature and Science, Japan",Kochi Prefectural Makino Botanical Garden,,,,,,,MBK,MBK,0003949-A,Specimen,,04:54.0,,,Tricyrtis macranthopsis Masam.,Masam.,Tricyrtis macranthopsis Masam.,Plantae,,,,Liliaceae,Tricyrtis,Japan,Japan,,Tanabe-shi,,Wakayama,Eastern Asia,Japan,,,,,,,,,,,,http://data.gbif.org/occurrences/354284596,http://data.gbif.org/ws/rest/occurrence/get?key=354284596
"National Museum of Nature and Science, Japan",Kochi Prefectural Makino Botanical Garden,,,,,,,MBK,MBK,3691,Specimen,,23:28.0,,,Tricyrtis macranthopsis Masam.,Masam.,Tricyrtis macranthopsis Masam.,Plantae,,,,Liliaceae,Tricyrtis,Japan,Japan,,Tanabe-shi,,Wakayama,Eastern Asia,Japan,33.7329,135.382,,44595,73,,,,,,,http://data.gbif.org/occurrences/287515483,http://data.gbif.org/ws/rest/occurrence/get?key=287515483
"National Museum of Nature and Science, Japan",Kochi Prefectural Makino Botanical Garden,,,,,,,MBK,MBK,3692,Specimen,,23:28.0,,,Tricyrtis macranthopsis Masam.,Masam.,Tricyrtis macranthopsis Masam.,Plantae,,,,Liliaceae,Tricyrtis,Japan,Japan,,Tanabe-shi,,Wakayama,Eastern Asia,Japan,33.7329,135.382,,44595,73,,,,,,,http://data.gbif.org/occurrences/287515484,http://data.gbif.org/ws/rest/occurrence/get?key=287515484
"National Museum of Nature and Science, Japan","Plant specimens depodited in Osaka Museum of Natural History, Japan.",,,,,,,OSA,C,OSA52018,Specimen,,25:07.0,,,Tricyrtis macranthopsis Masam.,Masam.,Tricyrtis macranthopsis Masam.,Plantae,,,,Liliaceae,Tricyrtis,Japan,Japan,Ohto National forest,Higashimuro-gun Hongu-cho,,Wakayama Prefecture,Eastern Asia,Japan,,,,,,,,,,,,http://data.gbif.org/occurrences/295176761,http://data.gbif.org/ws/rest/occurrence/get?key=295176761
"National Museum of Nature and Science, Japan","Plant specimens depodited in Osaka Museum of Natural History, Japan.",,,,,,,OSA,OSA,244139,Specimen,,25:05.0,,,Tricyrtis macranthopsis Masam.,Masam.,Tricyrtis macranthopsis Masam.,Plantae,,,,Liliaceae,Tricyrtis,Japan,Japan,,Yoshino-gun Totsukawamura,,Nara,Eastern Asia,Japan,34.4069,135.798,,44955,47,,,,,,,http://data.gbif.org/occurrences/204394580,http://data.gbif.org/ws/rest/occurrence/get?key=204394580
"National Museum of Nature and Science, Japan","Plant specimens depodited in Osaka Museum of Natural History, Japan.",,,,,,,OSA,OSA,251168,Specimen,,25:04.0,,,Tricyrtis macranthopsis Masam.,Masam.,Tricyrtis macranthopsis Masam.,Plantae,,,,Liliaceae,Tricyrtis,Japan,Japan,,Yoshino-gun Totsukawamura,,Nara,Eastern Asia,Japan,34.4069,135.798,,44955,47,,,,,,,http://data.gbif.org/occurrences/204394070,http://data.gbif.org/ws/rest/occurrence/get?key=204394070
"National Museum of Nature and Science, Japan","Plant specimens depodited in Osaka Museum of Natural History, Japan.",,,,,,,OSA,OSA,111866,Specimen,,25:05.0,,,Tricyrtis macranthopsis Masam.,Masam.,Tricyrtis macranthopsis Masam.,Plantae,,,,Liliaceae,Tricyrtis,Japan,Japan,,Yoshino-gun Totsukawamura,,Nara,Eastern Asia,Japan,34.4069,135.798,,44955,47,,,,,,,http://data.gbif.org/occurrences/204394582,http://data.gbif.org/ws/rest/occurrence/get?key=204394582
"National Museum of Nature and Science, Japan","Plant specimens depodited in Osaka Museum of Natural History, Japan.",,,,,,,OSA,OSA,244138,Specimen,,25:05.0,,,Tricyrtis macranthopsis Masam.,Masam.,Tricyrtis macranthopsis Masam.,Plantae,,,,Liliaceae,Tricyrtis,Japan,Japan,,Yoshino-gun Totsukawamura,,Nara,Eastern Asia,Japan,34.4069,135.798,,44955,47,,,,,,,http://data.gbif.org/occurrences/204394579,http://data.gbif.org/ws/rest/occurrence/get?key=204394579
"National Museum of Nature and Science, Japan","Plant specimens depodited in Osaka Museum of Natural History, Japan.",,,,,,,OSA,OSA,198962,Specimen,,25:05.0,,,Tricyrtis macranthopsis Masam.,Masam.,Tricyrtis macranthopsis Masam.,Plantae,,,,Liliaceae,Tricyrtis,Japan,Japan,,Yoshino-gun,,Nara,Eastern Asia,Japan,34.4069,135.798,,44955,47,,,,,,,http://data.gbif.org/occurrences/204394581,http://data.gbif.org/ws/rest/occurrence/get?key=204394581
"National Museum of Nature and Science, Japan","Plant specimens depodited in Osaka Museum of Natural History, Japan.",,,,,,,OSA,C,OSA79217,Specimen,,25:08.0,,,Tricyrtis macranthopsis Masam.,,Tricyrtis macranthopsis Masam.,Plantae,,,,Liliaceae,Tricyrtis,Japan,Japan,,Shingu-shi,,Wakayama,Eastern Asia,Japan,,,,,,,,,,,,http://data.gbif.org/occurrences/295176982,http://data.gbif.org/ws/rest/occurrence/get?key=295176982
"National Museum of Nature and Science, Japan",Plant Specimens of The Shimane Nature Museum of Mt. Sanbe,,,,,,,SNMS,P,482,Specimen,,46:14.0,,,Tricyrtis macranthopsis Masam.,,Tricyrtis macranthopsis Masam.,Plantae,,,Liliiflorae,Liliaceae,Tricyrtis,Japan,Japan,,closed,,Wakayama Pref.,Eastern Asia,Japan,,,,,,,,,,,,http://data.gbif.org/occurrences/143955602,http://data.gbif.org/ws/rest/occurrence/get?key=143955602
"Royal Botanic Gardens, Kew","Royal Botanic Gardens, Kew",http://www.kew.org/aboutus/legal.html,"Shibuya, K.",s.n.,,,,K,Herbarium,K000351639,Specimen,,27:39.0,"Landrein, S. & Price, K.",00:00.0,Tricyrtis macrantha Maxim. subsp. macranthopsis (Masamune) Kitamura,(Masamune) Kitamura,Tricyrtis macrantha subsp. macranthopsis (Masamune) Kitamura,Plantae,,,,CONVALLARIACEAE,Tricyrtis,Japan,Japan,"Cultivated, but of Japanese origin",,,,Eastern Asia,United Kingdom,,,,,,,,,,,,http://data.gbif.org/occurrences/45425590,http://data.gbif.org/ws/rest/occurrence/get?key=45425590
