Data Publisher,Dataset,Dataset Rights,Collector name,Collector number,Field number,GUID,Date collected,Institution code,Collection code,Catalogue number,Basis of record,Image url,Last indexed,Identifier,Identification date,Scientific name,Author,Scientific name (interpreted),Kingdom,Phylum,Class,Order,Family,Genus,Country,Country (interpreted),Locality,County,Continent or Ocean,State/Province,Region,Publisher country,Latitude,Longitude,Coordinate precision,Cell id,Centi cell id,Min depth,Max depth,Max depth,Min altitude,Max altitude,Altitude precision,GBIF portal url,GBIF webservice url
"National Museum of Nature and Science, Japan",Angiosperm specimens of Iwate Prefectural Museum,,,,,,,IPMM,PA,71301,Specimen,,59:19.0,,,Aconitum japonicum Thunb.  subsp. subcuneatum (Nakai) Kadota,Thunb.,Aconitum japonicum subsp. subcuneatum (Nakai) Kadota,Plantae,Angiospermae,Dicotyledoneae,,Ranunculaceae,Aconitum,Japan,Japan,,Kamihei-gun Otsuchicho,,Iwate,Eastern Asia,Japan,,,,,,,,,,,,http://data.gbif.org/occurrences/93879520,http://data.gbif.org/ws/rest/occurrence/get?key=93879520
"National Museum of Nature and Science, Japan",Angiosperm specimens of Iwate Prefectural Museum,,,,,,,IPMM,PA,71302,Specimen,,59:19.0,,,Aconitum japonicum Thunb.  subsp. subcuneatum (Nakai) Kadota,Thunb.,Aconitum japonicum subsp. subcuneatum (Nakai) Kadota,Plantae,Angiospermae,Dicotyledoneae,,Ranunculaceae,Aconitum,Japan,Japan,,Kamaishi-shi,,Iwate,Eastern Asia,Japan,,,,,,,,,,,,http://data.gbif.org/occurrences/93879539,http://data.gbif.org/ws/rest/occurrence/get?key=93879539
"National Museum of Nature and Science, Japan",Angiosperm specimens of Iwate Prefectural Museum,,,,,,,IPMM,PA,71309,Specimen,,59:19.0,,,Aconitum japonicum Thunb.  subsp. subcuneatum (Nakai) Kadota,Thunb.,Aconitum japonicum subsp. subcuneatum (Nakai) Kadota,Plantae,Angiospermae,Dicotyledoneae,,Ranunculaceae,Aconitum,Japan,Japan,,Kamaishi-shi,,Iwate,Eastern Asia,Japan,,,,,,,,,,,,http://data.gbif.org/occurrences/93879552,http://data.gbif.org/ws/rest/occurrence/get?key=93879552
"National Museum of Nature and Science, Japan",Angiosperm specimens of Iwate Prefectural Museum,,,,,,,IPMM,PA,71306,Specimen,,59:19.0,,,Aconitum japonicum Thunb.  subsp. subcuneatum (Nakai) Kadota,Thunb.,Aconitum japonicum subsp. subcuneatum (Nakai) Kadota,Plantae,Angiospermae,Dicotyledoneae,,Ranunculaceae,Aconitum,Japan,Japan,,Kamihei-gun Otsuchicho,,Iwate,Eastern Asia,Japan,,,,,,,,,,,,http://data.gbif.org/occurrences/93879518,http://data.gbif.org/ws/rest/occurrence/get?key=93879518
"National Museum of Nature and Science, Japan",Angiosperm specimens of Iwate Prefectural Museum,,,,,,,IPMM,PA,71300,Specimen,,59:19.0,,,Aconitum japonicum Thunb.  subsp. subcuneatum (Nakai) Kadota,Thunb.,Aconitum japonicum subsp. subcuneatum (Nakai) Kadota,Plantae,Angiospermae,Dicotyledoneae,,Ranunculaceae,Aconitum,Japan,Japan,,Miyako-shi,,Iwate,Eastern Asia,Japan,,,,,,,,,,,,http://data.gbif.org/occurrences/93879550,http://data.gbif.org/ws/rest/occurrence/get?key=93879550
"National Museum of Nature and Science, Japan",Angiosperm specimens of Iwate Prefectural Museum,,,,,,,IPMM,PA,71313,Specimen,,59:19.0,,,Aconitum japonicum Thunb.  subsp. subcuneatum (Nakai) Kadota,Thunb.,Aconitum japonicum subsp. subcuneatum (Nakai) Kadota,Plantae,Angiospermae,Dicotyledoneae,,Ranunculaceae,Aconitum,Japan,Japan,,Miyako-shi,,Iwate,Eastern Asia,Japan,,,,,,,,,,,,http://data.gbif.org/occurrences/93879535,http://data.gbif.org/ws/rest/occurrence/get?key=93879535
"National Museum of Nature and Science, Japan",Angiosperm specimens of Iwate Prefectural Museum,,,,,,,IPMM,PA,28603,Specimen,,59:21.0,,,Aconitum japonicum Thunb.  subsp. subcuneatum (Nakai) Kadota,Thunb.,Aconitum japonicum subsp. subcuneatum (Nakai) Kadota,Plantae,Angiospermae,Dicotyledoneae,Ranunculales,Ranunculaceae,Aconitum,Japan,Japan,,Towada-shi,,Aomori,Eastern Asia,Japan,,,,,,,,,,,,http://data.gbif.org/occurrences/204230687,http://data.gbif.org/ws/rest/occurrence/get?key=204230687
"National Museum of Nature and Science, Japan",Angiosperm specimens of Iwate Prefectural Museum,,,,,,,IPMM,PA,71304,Specimen,,59:19.0,,,Aconitum japonicum Thunb.  subsp. subcuneatum (Nakai) Kadota,Thunb.,Aconitum japonicum subsp. subcuneatum (Nakai) Kadota,Plantae,Angiospermae,Dicotyledoneae,,Ranunculaceae,Aconitum,Japan,Japan,,,,Niigata,Eastern Asia,Japan,,,,,,,,,,,,http://data.gbif.org/occurrences/93879553,http://data.gbif.org/ws/rest/occurrence/get?key=93879553
"National Museum of Nature and Science, Japan",Angiosperm specimens of Iwate Prefectural Museum,,,,,,,IPMM,PA,71311,Specimen,,59:19.0,,,Aconitum japonicum Thunb.  subsp. subcuneatum (Nakai) Kadota,Thunb.,Aconitum japonicum subsp. subcuneatum (Nakai) Kadota,Plantae,Angiospermae,Dicotyledoneae,,Ranunculaceae,Aconitum,Japan,Japan,,Kamaishi-shi,,Iwate,Eastern Asia,Japan,,,,,,,,,,,,http://data.gbif.org/occurrences/93879547,http://data.gbif.org/ws/rest/occurrence/get?key=93879547
"National Museum of Nature and Science, Japan",Angiosperm specimens of Iwate Prefectural Museum,,,,,,,IPMM,PA,71312,Specimen,,59:19.0,,,Aconitum japonicum Thunb.  subsp. subcuneatum (Nakai) Kadota,Thunb.,Aconitum japonicum subsp. subcuneatum (Nakai) Kadota,Plantae,Angiospermae,Dicotyledoneae,,Ranunculaceae,Aconitum,Japan,Japan,,Kamaishi-shi,,Iwate,Eastern Asia,Japan,,,,,,,,,,,,http://data.gbif.org/occurrences/93879528,http://data.gbif.org/ws/rest/occurrence/get?key=93879528
"National Museum of Nature and Science, Japan",Angiosperm specimens of Iwate Prefectural Museum,,,,,,,IPMM,PA,71305,Specimen,,59:19.0,,,Aconitum japonicum Thunb.  subsp. subcuneatum (Nakai) Kadota,Thunb.,Aconitum japonicum subsp. subcuneatum (Nakai) Kadota,Plantae,Angiospermae,Dicotyledoneae,,Ranunculaceae,Aconitum,Japan,Japan,,Ofunato-shi,,Iwate,Eastern Asia,Japan,,,,,,,,,,,,http://data.gbif.org/occurrences/93879522,http://data.gbif.org/ws/rest/occurrence/get?key=93879522
"National Museum of Nature and Science, Japan",Angiosperm specimens of Iwate Prefectural Museum,,,,,,,IPMM,PA,74657,Specimen,,59:19.0,,,Aconitum japonicum Thunb.  subsp. subcuneatum (Nakai) Kadota,Thunb.,Aconitum japonicum subsp. subcuneatum (Nakai) Kadota,Plantae,Angiospermae,Dicotyledoneae,,Ranunculaceae,Aconitum,Japan,Japan,,,,Niigata,Eastern Asia,Japan,,,,,,,,,,,,http://data.gbif.org/occurrences/93879554,http://data.gbif.org/ws/rest/occurrence/get?key=93879554
"National Museum of Nature and Science, Japan",Angiosperm specimens of Iwate Prefectural Museum,,,,,,,IPMM,PA,71303,Specimen,,59:19.0,,,Aconitum japonicum Thunb.  subsp. subcuneatum (Nakai) Kadota,Thunb.,Aconitum japonicum subsp. subcuneatum (Nakai) Kadota,Plantae,Angiospermae,Dicotyledoneae,,Ranunculaceae,Aconitum,Japan,Japan,,Iwate-gun Shizukuishicho,,Iwate,Eastern Asia,Japan,,,,,,,,,,,,http://data.gbif.org/occurrences/93879555,http://data.gbif.org/ws/rest/occurrence/get?key=93879555
"National Museum of Nature and Science, Japan",Angiosperm specimens of Iwate Prefectural Museum,,,,,,,IPMM,PA,78502,Specimen,,59:23.0,,,Aconitum japonicum Thunb.  subsp. subcuneatum (Nakai) Kadota,Thunb.,Aconitum japonicum subsp. subcuneatum (Nakai) Kadota,Plantae,Angiospermae,Dicotyledoneae,Ranunculales,Ranunculaceae,Aconitum,Japan,Japan,,Morioka-shi,,Iwate,Eastern Asia,Japan,,,,,,,,,,,,http://data.gbif.org/occurrences/204231030,http://data.gbif.org/ws/rest/occurrence/get?key=204231030
"National Museum of Nature and Science, Japan",Angiosperm specimens of Iwate Prefectural Museum,,,,,,,IPMM,PA,71308,Specimen,,59:19.0,,,Aconitum japonicum Thunb.  subsp. subcuneatum (Nakai) Kadota,Thunb.,Aconitum japonicum subsp. subcuneatum (Nakai) Kadota,Plantae,Angiospermae,Dicotyledoneae,,Ranunculaceae,Aconitum,Japan,Japan,,Kamaishi-shi,,Iwate,Eastern Asia,Japan,,,,,,,,,,,,http://data.gbif.org/occurrences/93879536,http://data.gbif.org/ws/rest/occurrence/get?key=93879536
"National Museum of Nature and Science, Japan",Angiosperm specimens of Iwate Prefectural Museum,,,,,,,IPMM,PA,71297,Specimen,,59:19.0,,,Aconitum japonicum Thunb.  subsp. subcuneatum (Nakai) Kadota,Thunb.,Aconitum japonicum subsp. subcuneatum (Nakai) Kadota,Plantae,Angiospermae,Dicotyledoneae,,Ranunculaceae,Aconitum,Japan,Japan,,Oshika-gun Onagawacho,,Miyagi,Eastern Asia,Japan,,,,,,,,,,,,http://data.gbif.org/occurrences/93879523,http://data.gbif.org/ws/rest/occurrence/get?key=93879523
"National Museum of Nature and Science, Japan",Angiosperm specimens of Iwate Prefectural Museum,,,,,,,IPMM,PA,71310,Specimen,,59:19.0,,,Aconitum japonicum Thunb.  subsp. subcuneatum (Nakai) Kadota,Thunb.,Aconitum japonicum subsp. subcuneatum (Nakai) Kadota,Plantae,Angiospermae,Dicotyledoneae,,Ranunculaceae,Aconitum,Japan,Japan,,Kamaishi-shi,,Iwate,Eastern Asia,Japan,,,,,,,,,,,,http://data.gbif.org/occurrences/93879538,http://data.gbif.org/ws/rest/occurrence/get?key=93879538
"National Museum of Nature and Science, Japan",Angiosperm specimens of Iwate Prefectural Museum,,,,,,,IPMM,PA,71307,Specimen,,59:19.0,,,Aconitum japonicum Thunb.  subsp. subcuneatum (Nakai) Kadota,Thunb.,Aconitum japonicum subsp. subcuneatum (Nakai) Kadota,Plantae,Angiospermae,Dicotyledoneae,,Ranunculaceae,Aconitum,Japan,Japan,,Kamaishi-shi,,Iwate,Eastern Asia,Japan,,,,,,,,,,,,http://data.gbif.org/occurrences/93879527,http://data.gbif.org/ws/rest/occurrence/get?key=93879527
"National Museum of Nature and Science, Japan",Angiosperm specimens of Iwate Prefectural Museum,,,,,,,IPMM,PA,22728,Specimen,,59:21.0,,,Aconitum japonicum Thunb.  subsp. subcuneatum (Nakai) Kadota,Thunb.,Aconitum japonicum subsp. subcuneatum (Nakai) Kadota,Plantae,Angiospermae,Dicotyledoneae,Ranunculales,Ranunculaceae,Aconitum,Japan,Japan,,Ichinoseki-shi,,Iwate,Eastern Asia,Japan,,,,,,,,,,,,http://data.gbif.org/occurrences/204230554,http://data.gbif.org/ws/rest/occurrence/get?key=204230554
"National Museum of Nature and Science, Japan",Angiosperm specimens of Iwate Prefectural Museum,,,,,,,IPMM,PA,71316,Specimen,,59:19.0,,,Aconitum japonicum Thunb.  subsp. subcuneatum (Nakai) Kadota,Thunb.,Aconitum japonicum subsp. subcuneatum (Nakai) Kadota,Plantae,Angiospermae,Dicotyledoneae,,Ranunculaceae,Aconitum,Japan,Japan,,,,Yamagata,Eastern Asia,Japan,,,,,,,,,,,,http://data.gbif.org/occurrences/93879516,http://data.gbif.org/ws/rest/occurrence/get?key=93879516
"National Museum of Nature and Science, Japan",Angiosperm specimens of Iwate Prefectural Museum,,,,,,,IPMM,PA,71314,Specimen,,59:19.0,,,Aconitum japonicum Thunb.  subsp. subcuneatum (Nakai) Kadota,Thunb.,Aconitum japonicum subsp. subcuneatum (Nakai) Kadota,Plantae,Angiospermae,Dicotyledoneae,,Ranunculaceae,Aconitum,Japan,Japan,,Kamaishi-shi,,Iwate,Eastern Asia,Japan,,,,,,,,,,,,http://data.gbif.org/occurrences/93879517,http://data.gbif.org/ws/rest/occurrence/get?key=93879517
"National Museum of Nature and Science, Japan",Angiosperm specimens of Iwate Prefectural Museum,,,,,,,IPMM,PA,74656,Specimen,,59:19.0,,,Aconitum japonicum Thunb.  subsp. subcuneatum (Nakai) Kadota,Thunb.,Aconitum japonicum subsp. subcuneatum (Nakai) Kadota,Plantae,Angiospermae,Dicotyledoneae,,Ranunculaceae,Aconitum,Japan,Japan,,Kamaishi-shi,,Iwate,Eastern Asia,Japan,,,,,,,,,,,,http://data.gbif.org/occurrences/93879549,http://data.gbif.org/ws/rest/occurrence/get?key=93879549
"National Museum of Nature and Science, Japan","Gunma Museum of Natural History, Vascular Plant Specimen",,,,,,,GMNHJ,plant,BS0001777,Specimen,,34:00.0,,,Aconitum japonicum Thunb.  subsp. subcuneatum (Nakai) Kadota,,Aconitum japonicum subsp. subcuneatum (Nakai) Kadota,Plantae,Spermatophyta,,,Ranunculaceae,Aconitum,Japan,Japan,"Higashi-ogawa,Lake Suga-numa",Tone-gun Katashinamura,,Gunma,Eastern Asia,Japan,36.8233,139.378,,45679,83,,,,,,,http://data.gbif.org/occurrences/188200499,http://data.gbif.org/ws/rest/occurrence/get?key=188200499
"National Museum of Nature and Science, Japan","FKSE-Herbarium specimens of Faculty of Symbiotic Systems Science, Fukushima University, Japan",,,,,,,FKSE,Plant,18709,Specimen,,50:49.0,,,Aconitum japonicum Thunb.  subsp. subcuneatum (Nakai) Kadota,Thunb.,Aconitum japonicum subsp. subcuneatum (Nakai) Kadota,Plantae,,,,RANUNCULACEAE,Aconitum,Japan,Japan,"Minatomachishizukata, Nakada, around Inawashiro Lake, Nakatahama.",Tsu-shi,,Fukushima,Eastern Asia,Japan,,,,,,,,,510,,,http://data.gbif.org/occurrences/391285747,http://data.gbif.org/ws/rest/occurrence/get?key=391285747
"National Museum of Nature and Science, Japan","FKSE-Herbarium specimens of Faculty of Symbiotic Systems Science, Fukushima University, Japan",,,,,,,FKSE,Plant,653,Specimen,,50:45.0,,,Aconitum japonicum Thunb.  subsp. subcuneatum (Nakai) Kadota,Thunb.,Aconitum japonicum subsp. subcuneatum (Nakai) Kadota,Plantae,,,,RANUNCULACEAE,Aconitum,Japan,Japan,"Honshu, Tohoku Distr., Fukushima Pref., Koriyama-shi, Ouse-machi",,,,Eastern Asia,Japan,,,,,,,,,,,,http://data.gbif.org/occurrences/238087684,http://data.gbif.org/ws/rest/occurrence/get?key=238087684
"National Museum of Nature and Science, Japan",Vascular plant specimens of Iida City Museum,,,,,,,ICM,HE,273,Specimen,,32:54.0,,,Aconitum japonicum Thunb.  subsp. subcuneatum (Nakai) Kadota,,Aconitum japonicum subsp. subcuneatum (Nakai) Kadota,Plantae,,,,Ranunculaceae,Aconitum,Japan,Japan,,Iida-shi,,Nagano,Eastern Asia,Japan,,,,,,,,,,596,,http://data.gbif.org/occurrences/322892445,http://data.gbif.org/ws/rest/occurrence/get?key=322892445
"National Museum of Nature and Science, Japan",Vascular plant specimens of Iida City Museum,,,,,,,ICM,HE,274,Specimen,,32:54.0,,,Aconitum japonicum Thunb.  subsp. subcuneatum (Nakai) Kadota,,Aconitum japonicum subsp. subcuneatum (Nakai) Kadota,Plantae,,,,Ranunculaceae,Aconitum,Japan,Japan,,Iida-shi,,Nagano,Eastern Asia,Japan,,,,,,,,,,596,,http://data.gbif.org/occurrences/322892446,http://data.gbif.org/ws/rest/occurrence/get?key=322892446
"National Museum of Nature and Science, Japan",Vascular plant specimens of Iida City Museum,,,,,,,ICM,HE,275,Specimen,,32:54.0,,,Aconitum japonicum Thunb.  subsp. subcuneatum (Nakai) Kadota,,Aconitum japonicum subsp. subcuneatum (Nakai) Kadota,Plantae,,,,Ranunculaceae,Aconitum,Japan,Japan,,Iida-shi,,Nagano,Eastern Asia,Japan,,,,,,,,,,596,,http://data.gbif.org/occurrences/322892447,http://data.gbif.org/ws/rest/occurrence/get?key=322892447
"National Museum of Nature and Science, Japan","Gunma Museum of Natural History, Vascular Plant Specimen",,,,,,,GMNHJ,plant,BS0032272,Specimen,,34:00.0,,,Aconitum japonicum Thunb. subsp. subcuneatum (Nakai) Kadota,Thunb.,Aconitum japonicum subsp. subcuneatum (Nakai) Kadota,Plantae,Spermatophyta,Dicotyledoneae,,Ranunculaceae,Aconitum,Japan,Japan,"Soto-tashiro Mire, Oze,Tokura",Tone-gun Katashinamura,,Gunma,Eastern Asia,Japan,36.9394,139.191,,45679,91,,,,,,,http://data.gbif.org/occurrences/234489042,http://data.gbif.org/ws/rest/occurrence/get?key=234489042
"National Museum of Nature and Science, Japan","Gunma Museum of Natural History, Vascular Plant Specimen",,,,,,,GMNHJ,plant,BS0033621,Specimen,,34:01.0,,,Aconitum japonicum Thunb. subsp. subcuneatum (Nakai) Kadota,Thunb.,Aconitum japonicum subsp. subcuneatum (Nakai) Kadota,Plantae,Spermatophyta,Dicotyledoneae,,Ranunculaceae,Aconitum,Japan,Japan,"Tanbara,Kami-hocchimachi",Numata-shi,,Gunma,Eastern Asia,Japan,36.7811,139.074,,45679,70,,,,,,,http://data.gbif.org/occurrences/295231390,http://data.gbif.org/ws/rest/occurrence/get?key=295231390
"National Institute of Genetics, ROIS","Plant Specimen Database of Tama Forest Science Garden, Forestry and Forest Products Research Institute, Japan",,,,,,,FFPRI,TFA,7527,Specimen,,21:31.0,,,Aconitum japonicum Thunb. subsp. subcuneatum (Nakai) Kadota,,Aconitum japonicum subsp. subcuneatum (Nakai) Kadota,Plantae,Magnoliophyta,Magnoliopsida,Ranunculales,Ranunculaceae,Aconitum,Japan,Japan,,Oga City,,Akita Prefecture,Eastern Asia,Japan,,,,,,,,,,,,http://data.gbif.org/occurrences/360250828,http://data.gbif.org/ws/rest/occurrence/get?key=360250828
"National Institute of Genetics, ROIS","Plant Specimen Database of Tama Forest Science Garden, Forestry and Forest Products Research Institute, Japan",,,,,,,FFPRI,TFA,9636,Specimen,,21:54.0,,,Aconitum japonicum Thunb. subsp. subcuneatum (Nakai) Kadota,,Aconitum japonicum subsp. subcuneatum (Nakai) Kadota,Plantae,Magnoliophyta,Magnoliopsida,Ranunculales,Ranunculaceae,Aconitum,Japan,Japan,,,,Yamanasi Prefecture,Eastern Asia,Japan,,,,,,,,,,,,http://data.gbif.org/occurrences/360252943,http://data.gbif.org/ws/rest/occurrence/get?key=360252943
"National Institute of Genetics, ROIS","Plant Specimen Database of Tama Forest Science Garden, Forestry and Forest Products Research Institute, Japan",,,,,,,FFPRI,TFA,29552,Specimen,,25:32.0,,,Aconitum japonicum Thunb. subsp. subcuneatum (Nakai) Kadota,,Aconitum japonicum subsp. subcuneatum (Nakai) Kadota,Plantae,Magnoliophyta,Magnoliopsida,Ranunculales,Ranunculaceae,Aconitum,Japan,Japan,Mt. Hakkoda,,,Aomori Prefecture,Eastern Asia,Japan,40.6592,140.8771,,47120,68,,,,1000,1584,,http://data.gbif.org/occurrences/360272853,http://data.gbif.org/ws/rest/occurrence/get?key=360272853
"National Institute of Genetics, ROIS","Plant Specimen Database of Tama Forest Science Garden, Forestry and Forest Products Research Institute, Japan",,,,,,,FFPRI,TFA,29551,Specimen,,25:32.0,,,Aconitum japonicum Thunb. subsp. subcuneatum (Nakai) Kadota,,Aconitum japonicum subsp. subcuneatum (Nakai) Kadota,Plantae,Magnoliophyta,Magnoliopsida,Ranunculales,Ranunculaceae,Aconitum,Japan,Japan,Mt. Hakkoda,,,Aomori Prefecture,Eastern Asia,Japan,40.6592,140.8771,,47120,68,,,,1000,1584,,http://data.gbif.org/occurrences/360272852,http://data.gbif.org/ws/rest/occurrence/get?key=360272852
"National Institute of Genetics, ROIS","Plant Specimen Database of Tama Forest Science Garden, Forestry and Forest Products Research Institute, Japan",,,,,,,FFPRI,TFA,29550,Specimen,,25:32.0,,,Aconitum japonicum Thunb. subsp. subcuneatum (Nakai) Kadota,,Aconitum japonicum subsp. subcuneatum (Nakai) Kadota,Plantae,Magnoliophyta,Magnoliopsida,Ranunculales,Ranunculaceae,Aconitum,Japan,Japan,,,,Iwate Prefecture,Eastern Asia,Japan,,,,,,,,,,,,http://data.gbif.org/occurrences/360272851,http://data.gbif.org/ws/rest/occurrence/get?key=360272851
"National Institute of Genetics, ROIS","Plant Specimen Database of Tama Forest Science Garden, Forestry and Forest Products Research Institute, Japan",,,,,,,FFPRI,TFA,7528,Specimen,,21:31.0,,,Aconitum japonicum Thunb. subsp. subcuneatum (Nakai) Kadota,,Aconitum japonicum subsp. subcuneatum (Nakai) Kadota,Plantae,Magnoliophyta,Magnoliopsida,Ranunculales,Ranunculaceae,Aconitum,Japan,Japan,,Oga City,,Akita Prefecture,Eastern Asia,Japan,,,,,,,,,,,,http://data.gbif.org/occurrences/360250829,http://data.gbif.org/ws/rest/occurrence/get?key=360250829
"National Institute of Genetics, ROIS","Plant Specimen Database of Tama Forest Science Garden, Forestry and Forest Products Research Institute, Japan",,,,,,,FFPRI,TFA,29548,Specimen,,25:32.0,,,Aconitum japonicum Thunb. subsp. subcuneatum (Nakai) Kadota,,Aconitum japonicum subsp. subcuneatum (Nakai) Kadota,Plantae,Magnoliophyta,Magnoliopsida,Ranunculales,Ranunculaceae,Aconitum,Japan,Japan,Mt. Sirouma,,,Nagano Prefecture,Eastern Asia,Japan,36.75861,137.7586,,45677,77,,,,,2932,,http://data.gbif.org/occurrences/360272849,http://data.gbif.org/ws/rest/occurrence/get?key=360272849
"National Institute of Genetics, ROIS","Plant Specimen Database of Tama Forest Science Garden, Forestry and Forest Products Research Institute, Japan",,,,,,,FFPRI,TFA,29549,Specimen,,25:32.0,,,Aconitum japonicum Thunb. subsp. subcuneatum (Nakai) Kadota,,Aconitum japonicum subsp. subcuneatum (Nakai) Kadota,Plantae,Magnoliophyta,Magnoliopsida,Ranunculales,Ranunculaceae,Aconitum,Japan,Japan,Mt. Haguro,,,Yamagata Prefecture,Eastern Asia,Japan,,,,,,,,,,,,http://data.gbif.org/occurrences/360272850,http://data.gbif.org/ws/rest/occurrence/get?key=360272850
"National Institute of Genetics, ROIS","Plant Specimen Database of Tama Forest Science Garden, Forestry and Forest Products Research Institute, Japan",,,,,,,FFPRI,TFA,29553,Specimen,,25:32.0,,,Aconitum japonicum Thunb. subsp. subcuneatum (Nakai) Kadota,,Aconitum japonicum subsp. subcuneatum (Nakai) Kadota,Plantae,Magnoliophyta,Magnoliopsida,Ranunculales,Ranunculaceae,Aconitum,Japan,Japan,,,,Aomori Prefecture,Eastern Asia,Japan,,,,,,,,,,,,http://data.gbif.org/occurrences/360272854,http://data.gbif.org/ws/rest/occurrence/get?key=360272854
"National Museum of Nature and Science, Japan",Vascular Plant Specimen Database of Kanagawa Prefectural Museum of Natural History,,,,,,,KPM,NA,KPM-NA0161836,Specimen,,21:29.0,,,Aconitum japonicum Thunb. subsp. subcuneatum (Nakai) Kadota,,Aconitum japonicum subsp. subcuneatum (Nakai) Kadota,Plantae,Angiospermae,Dicotyledoneae,,RANUNCULACEAE,Aconitum,Japan,Japan,,Iida-shi,,Nagano Prefecture,Eastern Asia,Japan,,,,,,,,,,,,http://data.gbif.org/occurrences/388786743,http://data.gbif.org/ws/rest/occurrence/get?key=388786743
"National Museum of Nature and Science, Japan",Vascular plant specimens of Akita Prefectural Museum,,,,,,,AKPM,vs,48999,Specimen,,38:42.0,,,Aconitum japonicum Thunb. subsp. subcuneatum (Nakai) Kadota,Thunb.,Aconitum japonicum subsp. subcuneatum (Nakai) Kadota,Plantae,Spermatophyta,Dicotyledoneae,,Ranunculaceae,Aconitum,Japan,Japan,Kuzoguro,Kitaakita-gun Takanosumachi,,Akita,Eastern Asia,Japan,,,,,,,,,,,,http://data.gbif.org/occurrences/296207870,http://data.gbif.org/ws/rest/occurrence/get?key=296207870
"National Museum of Nature and Science, Japan",Vascular plant specimens of Akita Prefectural Museum,,,,,,,AKPM,vs,12968,Specimen,,38:42.0,,,Aconitum japonicum Thunb. subsp. subcuneatum (Nakai) Kadota,Thunb.,Aconitum japonicum subsp. subcuneatum (Nakai) Kadota,Plantae,Spermatophyta,Dicotyledoneae,,Ranunculaceae,Aconitum,Japan,Japan,Tazawa,Semboku-gun Tazawakomachi,,Akita,Eastern Asia,Japan,,,,,,,,,,,,http://data.gbif.org/occurrences/296207824,http://data.gbif.org/ws/rest/occurrence/get?key=296207824
"National Museum of Nature and Science, Japan",Vascular plant specimens of Akita Prefectural Museum,,,,,,,AKPM,vs,49000,Specimen,,38:42.0,,,Aconitum japonicum Thunb. subsp. subcuneatum (Nakai) Kadota,Thunb.,Aconitum japonicum subsp. subcuneatum (Nakai) Kadota,Plantae,Spermatophyta,Dicotyledoneae,,Ranunculaceae,Aconitum,Japan,Japan,Ofunakizawa,Kitaakita-gun Takanosumachi,,Akita,Eastern Asia,Japan,,,,,,,,,,,,http://data.gbif.org/occurrences/296207871,http://data.gbif.org/ws/rest/occurrence/get?key=296207871
"National Museum of Nature and Science, Japan",Vascular plant specimens of Akita Prefectural Museum,,,,,,,AKPM,vs,49004,Specimen,,38:42.0,,,Aconitum japonicum Thunb. subsp. subcuneatum (Nakai) Kadota,Thunb.,Aconitum japonicum subsp. subcuneatum (Nakai) Kadota,Plantae,Spermatophyta,Dicotyledoneae,,Ranunculaceae,Aconitum,Japan,Japan,Furokura,Kazuno-shi,,Akita,Eastern Asia,Japan,,,,,,,,,,,,http://data.gbif.org/occurrences/296207875,http://data.gbif.org/ws/rest/occurrence/get?key=296207875
"National Museum of Nature and Science, Japan",Vascular plant specimens of Akita Prefectural Museum,,,,,,,AKPM,vs,55394,Specimen,,38:48.0,,,Aconitum japonicum Thunb. subsp. subcuneatum (Nakai) Kadota,Thunb.,Aconitum japonicum subsp. subcuneatum (Nakai) Kadota,Plantae,Angiospermae,Dicotyledoneae,,Ranunculaceae,Aconitum,Japan,Japan,Okuyamasawa,Semboku-gun Kyowamachi,,Akita,Eastern Asia,Japan,,,,,,,,,,,,http://data.gbif.org/occurrences/624028012,http://data.gbif.org/ws/rest/occurrence/get?key=624028012
"National Museum of Nature and Science, Japan",Vascular plant specimens of Akita Prefectural Museum,,,,,,,AKPM,vs,49005,Specimen,,38:42.0,,,Aconitum japonicum Thunb. subsp. subcuneatum (Nakai) Kadota,Thunb.,Aconitum japonicum subsp. subcuneatum (Nakai) Kadota,Plantae,Spermatophyta,Dicotyledoneae,,Ranunculaceae,Aconitum,Japan,Japan,Yuze,Kazuno-shi,,Akita,Eastern Asia,Japan,,,,,,,,,,,,http://data.gbif.org/occurrences/296207876,http://data.gbif.org/ws/rest/occurrence/get?key=296207876