Data Publisher,Dataset,Dataset Rights,Collector name,Collector number,Field number,GUID,Date collected,Institution code,Collection code,Catalogue number,Basis of record,Image url,Last indexed,Identifier,Identification date,Scientific name,Author,Scientific name (interpreted),Kingdom,Phylum,Class,Order,Family,Genus,Country,Country (interpreted),Locality,County,Continent or Ocean,State/Province,Region,Publisher country,Latitude,Longitude,Coordinate precision,Cell id,Centi cell id,Min depth,Max depth,Max depth,Min altitude,Max altitude,Altitude precision,GBIF portal url,GBIF webservice url
"National Museum of Nature and Science, Japan",Kochi Prefectural Makino Botanical Garden,,,,,,,MBK,MBK,30,Specimen,,02:57.0,,,Berberis tschonoskyana Regel,Regel,Berberis tschonoskyana Regel,Plantae,,,,Berberidaceae,Berberis,Japan,Japan,,,,Tokushima,Eastern Asia,Japan,,,,,,,,,,,,http://data.gbif.org/occurrences/287492193,http://data.gbif.org/ws/rest/occurrence/get?key=287492193
"National Museum of Nature and Science, Japan",Kochi Prefectural Makino Botanical Garden,,,,,,,MBK,MBK,30,Specimen,,59:05.0,,,Berberis tschonoskyana Regel,Regel,Berberis tschonoskyana Regel,Plantae,,,,Berberidaceae,Berberis,Japan,Japan,Mt. Tsurugi-san,,,Tokushima,Eastern Asia,Japan,,,,,,,,,,,,http://data.gbif.org/occurrences/354275055,http://data.gbif.org/ws/rest/occurrence/get?key=354275055
"National Institute of Genetics, ROIS","Plant Specimen Database of Tama Forest Science Garden, Forestry and Forest Products Research Institute, Japan",,,,,,,FFPRI,TFA,7823,Specimen,,21:34.0,,,Berberis tschonoskyana Regel,,Berberis tschonoskyana Regel,Plantae,Magnoliophyta,Magnoliopsida,Ranunculales,Berberidaceae,Berberis,Japan,Japan,Mt. Omine,Yosino County,,Nara Prefecture,Eastern Asia,Japan,,,,,,,,,,,,http://data.gbif.org/occurrences/360251124,http://data.gbif.org/ws/rest/occurrence/get?key=360251124
"National Institute of Genetics, ROIS","Plant Specimen Database of Tama Forest Science Garden, Forestry and Forest Products Research Institute, Japan",,,,,,,FFPRI,TFA,7824,Specimen,,21:34.0,,,Berberis tschonoskyana Regel,,Berberis tschonoskyana Regel,Plantae,Magnoliophyta,Magnoliopsida,Ranunculales,Berberidaceae,Berberis,Japan,Japan,,,,Toyama Prefecture,Eastern Asia,Japan,,,,,,,,,,,,http://data.gbif.org/occurrences/360251125,http://data.gbif.org/ws/rest/occurrence/get?key=360251125
"National Institute of Genetics, ROIS","Plant Specimen Database of Tama Forest Science Garden, Forestry and Forest Products Research Institute, Japan",,,,,,,FFPRI,TFA,7821,Specimen,,21:34.0,,,Berberis tschonoskyana Regel,,Berberis tschonoskyana Regel,Plantae,Magnoliophyta,Magnoliopsida,Ranunculales,Berberidaceae,Berberis,Japan,Japan,Nikko,,,Totigi Prefecture,Eastern Asia,Japan,,,,,,,,,,,,http://data.gbif.org/occurrences/360251122,http://data.gbif.org/ws/rest/occurrence/get?key=360251122
"National Institute of Genetics, ROIS","Plant Specimen Database of Tama Forest Science Garden, Forestry and Forest Products Research Institute, Japan",,,,,,,FFPRI,TFA,7825,Specimen,,21:34.0,,,Berberis tschonoskyana Regel,,Berberis tschonoskyana Regel,Plantae,Magnoliophyta,Magnoliopsida,Ranunculales,Berberidaceae,Berberis,Japan,Japan,Mt. Isizuti,,,Ehime Prefecture,Eastern Asia,Japan,33.76031,133.11327,,44593,71,,,,,1982,,http://data.gbif.org/occurrences/360251126,http://data.gbif.org/ws/rest/occurrence/get?key=360251126
"National Institute of Genetics, ROIS","Plant Specimen Database of Tama Forest Science Garden, Forestry and Forest Products Research Institute, Japan",,,,,,,FFPRI,TFA,7822,Specimen,,21:34.0,,,Berberis tschonoskyana Regel,,Berberis tschonoskyana Regel,Plantae,Magnoliophyta,Magnoliopsida,Ranunculales,Berberidaceae,Berberis,Japan,Japan,Mt. Omine,Yosino County,,Nara Prefecture,Eastern Asia,Japan,,,,,,,,,,,,http://data.gbif.org/occurrences/360251123,http://data.gbif.org/ws/rest/occurrence/get?key=360251123
"National Museum of Nature and Science, Japan","Plant specimens depodited in Osaka Museum of Natural History, Japan.",,,,,,,OSA,C,OSA3748,Specimen,,16:34.0,,,Berberis tschonoskyana Regel,Regel,Berberis tschonoskyana Regel,Plantae,,,,Berberidaceae,Berberis,Japan,Japan,Kawakami to Tonomine-kogen highland,Kanzaki-gun Okawachicho,,Hyogo Prefecture,Eastern Asia,Japan,,,,,,,,,,,,http://data.gbif.org/occurrences/295112396,http://data.gbif.org/ws/rest/occurrence/get?key=295112396
"National Museum of Nature and Science, Japan","Plant specimens depodited in Osaka Museum of Natural History, Japan.",,,,,,,OSA,C,OSA80703,Specimen,,16:37.0,,,Berberis tschonoskyana Regel,,Berberis tschonoskyana Regel,Plantae,,,,Berberidaceae,Berberis,Japan,Japan,Mts. Odaigahara,Yoshino-gun Kamikitayamamura,,Nara,Eastern Asia,Japan,,,,,,,,,,,,http://data.gbif.org/occurrences/295113005,http://data.gbif.org/ws/rest/occurrence/get?key=295113005
"National Museum of Nature and Science, Japan","Plant specimens depodited in Osaka Museum of Natural History, Japan.",,,,,,,OSA,C,OSA22539,Specimen,,16:35.0,,,Berberis tschonoskyana Regel,Regel,Berberis tschonoskyana Regel,Plantae,,,,Berberidaceae,Berberis,Japan,Japan,Mt. Inamuraga-take,,,Nara Prefecture,Eastern Asia,Japan,,,,,,,,,,,,http://data.gbif.org/occurrences/295112531,http://data.gbif.org/ws/rest/occurrence/get?key=295112531
"National Museum of Nature and Science, Japan","Plant specimens depodited in Osaka Museum of Natural History, Japan.",,,,,,,OSA,C,OSA781,Specimen,,16:34.0,,,Berberis tschonoskyana Regel,Regel,Berberis tschonoskyana Regel,Plantae,,,,Berberidaceae,Berberis,Japan,Japan,Myojin-daira,Yoshino-gun Higashi-Yoshino-mura,,Nara Prefecture,Eastern Asia,Japan,,,,,,,,,,,,http://data.gbif.org/occurrences/295112377,http://data.gbif.org/ws/rest/occurrence/get?key=295112377
"Royal Botanic Gardens, Kew","Royal Botanic Gardens, Kew",http://www.kew.org/aboutus/legal.html,"Tschonoski, S.",s.n.,,,,K,Herbarium,K000644922,Specimen,,56:30.0,"Schneider, C.",00:00.0,Berberis tschonoskyana Regel,Regel,Berberis tschonoskyana Regel,Plantae,,,,BERBERIDACEAE,Berberis,Japan,Japan,[illegible] [Niko],,,,Eastern Asia,United Kingdom,,,,,,,,,,,,http://data.gbif.org/occurrences/234366150,http://data.gbif.org/ws/rest/occurrence/get?key=234366150
