Data Publisher,Dataset,Dataset Rights,Collector name,Collector number,Field number,GUID,Date collected,Institution code,Collection code,Catalogue number,Basis of record,Image url,Last indexed,Identifier,Identification date,Scientific name,Author,Scientific name (interpreted),Kingdom,Phylum,Class,Order,Family,Genus,Country,Country (interpreted),Locality,County,Continent or Ocean,State/Province,Region,Publisher country,Latitude,Longitude,Coordinate precision,Cell id,Centi cell id,Min depth,Max depth,Max depth,Min altitude,Max altitude,Altitude precision,GBIF portal url,GBIF webservice url
GBIF-Sweden,Botany (UPS),,Jisaburo Ohwi,,,,00:00.0,UPS,Botany,V-230296,Specimen,,27:42.0,,,Geranium sibiricum,,Geranium sibiricum,Plantae,,,,Geraniaceae,Geranium,Japan,Japan,,,,Hokkaido,Eastern Asia,Sweden,,,,,,,,,,,,http://data.gbif.org/occurrences/215264081,http://data.gbif.org/ws/rest/occurrence/get?key=215264081
GBIF-Spain,"Real Jardin Botanico (Madrid), Vascular Plant Herbarium (MA)",http://www.rjb.csic.es/herbario/crypto/crypcond.htm,B. Est?banez,s/n,,,00:00.0,MA,MA,727357-1,Specimen,,15:47.0,,,Geranium sibiricum,,Geranium sibiricum,Plantae,,,,Geraniaceae,Geranium,JP,Japan,"Hokkaido, Kushiro-shitsugen, v?a de transporte que cruza el humedal",,,,Eastern Asia,Spain,,,,,,,,,,,,http://data.gbif.org/occurrences/142958965,http://data.gbif.org/ws/rest/occurrence/get?key=142958965
"National Museum of Nature and Science, Japan","FKSE-Herbarium specimens of Faculty of Symbiotic Systems Science, Fukushima University, Japan",,,,,,,FKSE,Plant,2143,Specimen,,51:57.0,,,Geranium sibiricum L.,L.,Geranium sibiricum L.,Plantae,,,,GERANIACEAE,Geranium,Japan,Japan,"Hokkaido, Kawakami-gun, Tesikaga-cho, Wakoto",,,,Eastern Asia,Japan,,,,,,,,,,,,http://data.gbif.org/occurrences/238094014,http://data.gbif.org/ws/rest/occurrence/get?key=238094014
"National Museum of Nature and Science, Japan",Plant Specimens of Kurashiki Museum of Natural History,,,,,,,KURA,KURA,133707,Specimen,,14:58.0,,,Geranium sibiricum L.,L.,Geranium sibiricum L.,Plantae,,,,Geraniaceae,Geranium,Japan,Japan,,,,Hokkaido,Eastern Asia,Japan,,,,,,,,,,,,http://data.gbif.org/occurrences/43136979,http://data.gbif.org/ws/rest/occurrence/get?key=43136979
"National Museum of Nature and Science, Japan",Plant Specimens of Kurashiki Museum of Natural History,,,,,,,KURA,KURA,133711,Specimen,,14:58.0,,,Geranium sibiricum L.,L.,Geranium sibiricum L.,Plantae,,,,Geraniaceae,Geranium,Japan,Japan,,,,Hokkaido,Eastern Asia,Japan,,,,,,,,,,,,http://data.gbif.org/occurrences/43137007,http://data.gbif.org/ws/rest/occurrence/get?key=43137007
"National Museum of Nature and Science, Japan",Plant Specimens of Kurashiki Museum of Natural History,,,,,,,KURA,KURA,133705,Specimen,,14:58.0,,,Geranium sibiricum L.,L.,Geranium sibiricum L.,Plantae,,,,Geraniaceae,Geranium,Japan,Japan,,,,Hokkaido,Eastern Asia,Japan,,,,,,,,,,,,http://data.gbif.org/occurrences/43136968,http://data.gbif.org/ws/rest/occurrence/get?key=43136968
"National Museum of Nature and Science, Japan",Plant Specimens of Kurashiki Museum of Natural History,,,,,,,KURA,KURA,133709,Specimen,,14:58.0,,,Geranium sibiricum L.,L.,Geranium sibiricum L.,Plantae,,,,Geraniaceae,Geranium,Japan,Japan,,,,Hokkaido,Eastern Asia,Japan,,,,,,,,,,,,http://data.gbif.org/occurrences/43136991,http://data.gbif.org/ws/rest/occurrence/get?key=43136991
"National Museum of Nature and Science, Japan",Plant Specimens of Kurashiki Museum of Natural History,,,,,,,KURA,KURA,133710,Specimen,,14:58.0,,,Geranium sibiricum L.,L.,Geranium sibiricum L.,Plantae,,,,Geraniaceae,Geranium,Japan,Japan,,,,Hokkaido,Eastern Asia,Japan,,,,,,,,,,,,http://data.gbif.org/occurrences/43136998,http://data.gbif.org/ws/rest/occurrence/get?key=43136998
"National Museum of Nature and Science, Japan",Plant Specimens of Kurashiki Museum of Natural History,,,,,,,KURA,KURA,133706,Specimen,,14:58.0,,,Geranium sibiricum L.,L.,Geranium sibiricum L.,Plantae,,,,Geraniaceae,Geranium,Japan,Japan,,,,Hokkaido,Eastern Asia,Japan,,,,,,,,,,,,http://data.gbif.org/occurrences/43137017,http://data.gbif.org/ws/rest/occurrence/get?key=43137017
"National Museum of Nature and Science, Japan",Plant Specimens of Kurashiki Museum of Natural History,,,,,,,KURA,KURA,133712,Specimen,,14:58.0,,,Geranium sibiricum L.,L.,Geranium sibiricum L.,Plantae,,,,Geraniaceae,Geranium,Japan,Japan,,,,Hokkaido,Eastern Asia,Japan,,,,,,,,,,,,http://data.gbif.org/occurrences/43137013,http://data.gbif.org/ws/rest/occurrence/get?key=43137013
"National Museum of Nature and Science, Japan",Plant Specimens of Kurashiki Museum of Natural History,,,,,,,KURA,KURA,133708,Specimen,,14:58.0,,,Geranium sibiricum L.,L.,Geranium sibiricum L.,Plantae,,,,Geraniaceae,Geranium,Japan,Japan,,,,Hokkaido,Eastern Asia,Japan,,,,,,,,,,,,http://data.gbif.org/occurrences/43136986,http://data.gbif.org/ws/rest/occurrence/get?key=43136986
"National Museum of Nature and Science, Japan",Plant Specimens of Kurashiki Museum of Natural History,,,,,,,KURA,KURA,133713,Specimen,,14:58.0,,,Geranium sibiricum L.,L.,Geranium sibiricum L.,Plantae,,,,Geraniaceae,Geranium,Japan,Japan,,,,Hokkaido,Eastern Asia,Japan,,,,,,,,,,,,http://data.gbif.org/occurrences/43136971,http://data.gbif.org/ws/rest/occurrence/get?key=43136971
GBIF-Spain,"Real Jardin Botanico (Madrid), Vascular Plant Herbarium (MA)",http://www.rjb.csic.es/herbario/crypto/crypcond.htm,B. Est?banez,s/n,,,00:00.0,MA,MA,727358-1,Specimen,,15:47.0,,,Geranium sibiricum L.,L.,Geranium sibiricum L.,Plantae,,,,Geraniaceae,Geranium,JP,Japan,"Hokkaido, Kushiro-shitsugen, via de transporte que cruza el humedal",,,,Eastern Asia,Spain,,,,,,,,,,,,http://data.gbif.org/occurrences/142958966,http://data.gbif.org/ws/rest/occurrence/get?key=142958966
Royal Botanic Garden Edinburgh,RBGE Herbarium (E),Copyright Royal Botanic Garden Edinburgh. Contact us for rights to commercial use.,AGS Expedition to Japan (1988),415,,,00:00.0,E,E,E00247583,Specimen,,37:16.0,,,Geranium sibiricum L.,,Geranium sibiricum L.,,,,,Geraniaceae,Geranium,JP,Japan,Lake Kusshara,,,Hokkaido,Eastern Asia,,,,,,,,,,150,150,,http://data.gbif.org/occurrences/575134320,http://data.gbif.org/ws/rest/occurrence/get?key=575134320
"National Museum of Nature and Science, Japan",Vascular Plant Specimen Database of Kanagawa Prefectural Museum of Natural History,,,,,,,KPM,NA,KPM-NA0016198,Specimen,,26:30.0,,,Geranium sibiricum L. var. glabrius (H.Hara) Ohwi,,Geranium sibiricum var. glabrius (H.Hara) Ohwi,Plantae,Angiospermae,Dicotyledoneae,,GERANIACEAE,Geranium,Japan,Japan,,"Rishiri-gun, Rishirifuji-cho",,Hokkaido,Eastern Asia,Japan,,,,,,,,,,,,http://data.gbif.org/occurrences/388829413,http://data.gbif.org/ws/rest/occurrence/get?key=388829413
"National Museum of Nature and Science, Japan",Vascular Plant Specimen Database of Kanagawa Prefectural Museum of Natural History,,,,,,,KPM,NA,KPM-NA0019199,Specimen,,26:30.0,,,Geranium sibiricum L. var. glabrius (H.Hara) Ohwi,,Geranium sibiricum var. glabrius (H.Hara) Ohwi,Plantae,Angiospermae,Dicotyledoneae,,GERANIACEAE,Geranium,Japan,Japan,,"Samani-gun, Samani-cho",,Hokkaido,Eastern Asia,Japan,,,,,,,,,,,,http://data.gbif.org/occurrences/388829428,http://data.gbif.org/ws/rest/occurrence/get?key=388829428
"National Museum of Nature and Science, Japan",Vascular Plant Specimen Database of Kanagawa Prefectural Museum of Natural History,,,,,,,KPM,NA,KPM-NA0068642,Specimen,,26:31.0,,,Geranium sibiricum L. var. glabrius (H.Hara) Ohwi,,Geranium sibiricum var. glabrius (H.Hara) Ohwi,Plantae,Angiospermae,Dicotyledoneae,,GERANIACEAE,Geranium,Japan,Japan,,"Akkeshi-gun, Hamanaka-cho",,Hokkaido,Eastern Asia,Japan,,,,,,,,,,,,http://data.gbif.org/occurrences/388829519,http://data.gbif.org/ws/rest/occurrence/get?key=388829519
"National Museum of Nature and Science, Japan",Vascular Plant Specimen Database of Kanagawa Prefectural Museum of Natural History,,,,,,,KPM,NA,KPM-NA0092697,Specimen,,26:31.0,,,Geranium sibiricum L. var. glabrius (H.Hara) Ohwi,,Geranium sibiricum var. glabrius (H.Hara) Ohwi,Plantae,Angiospermae,Dicotyledoneae,,GERANIACEAE,Geranium,Japan,Japan,,"Rebun-gun, Rebun-cho",,Hokkaido,Eastern Asia,Japan,,,,,,,,,,,,http://data.gbif.org/occurrences/388829550,http://data.gbif.org/ws/rest/occurrence/get?key=388829550
"National Museum of Nature and Science, Japan",Vascular Plant Specimen Database of Kanagawa Prefectural Museum of Natural History,,,,,,,KPM,NA,KPM-NA0016199,Specimen,,26:30.0,,,Geranium sibiricum L. var. glabrius (H.Hara) Ohwi,,Geranium sibiricum var. glabrius (H.Hara) Ohwi,Plantae,Angiospermae,Dicotyledoneae,,GERANIACEAE,Geranium,Japan,Japan,,"Samani-gun, Samani-cho",,Hokkaido,Eastern Asia,Japan,,,,,,,,,,,,http://data.gbif.org/occurrences/388829414,http://data.gbif.org/ws/rest/occurrence/get?key=388829414
"National Museum of Nature and Science, Japan",Vascular Plant Specimen Database of Kanagawa Prefectural Museum of Natural History,,,,,,,KPM,NA,KPM-NA0050610,Specimen,,26:31.0,,,Geranium sibiricum L. var. glabrius (H.Hara) Ohwi,,Geranium sibiricum var. glabrius (H.Hara) Ohwi,Plantae,Angiospermae,Dicotyledoneae,,GERANIACEAE,Geranium,Japan,Japan,,"Samani-gun, Samani-cho",,Hokkaido,Eastern Asia,Japan,,,,,,,,,,,,http://data.gbif.org/occurrences/388829487,http://data.gbif.org/ws/rest/occurrence/get?key=388829487
"National Museum of Nature and Science, Japan",Vascular Plant Specimen Database of Kanagawa Prefectural Museum of Natural History,,,,,,,KPM,NA,KPM-NA0123698,Specimen,,26:31.0,,,Geranium sibiricum L. var. glabrius (H.Hara) Ohwi,,Geranium sibiricum var. glabrius (H.Hara) Ohwi,Plantae,Angiospermae,Dicotyledoneae,,GERANIACEAE,Geranium,Japan,Japan,,"Yokohama-shi, Seya-ku",,Kanagawa Prefecture,Eastern Asia,Japan,,,,,,,,,60,,,http://data.gbif.org/occurrences/388829617,http://data.gbif.org/ws/rest/occurrence/get?key=388829617
"National Museum of Nature and Science, Japan",Vascular Plant Specimen Database of Kanagawa Prefectural Museum of Natural History,,,,,,,KPM,NA,KPM-NA0071705,Specimen,,26:31.0,,,Geranium sibiricum L. var. glabrius (H.Hara) Ohwi,,Geranium sibiricum var. glabrius (H.Hara) Ohwi,Plantae,Angiospermae,Dicotyledoneae,,GERANIACEAE,Geranium,Japan,Japan,,"Soya-gun, Sarufutsu-mura",,Hokkaido,Eastern Asia,Japan,,,,,,,,,,,,http://data.gbif.org/occurrences/388829528,http://data.gbif.org/ws/rest/occurrence/get?key=388829528
"National Museum of Nature and Science, Japan",Vascular Plant Specimen Database of Kanagawa Prefectural Museum of Natural History,,,,,,,KPM,NA,KPM-NA0073343,Specimen,,26:31.0,,,Geranium sibiricum L. var. glabrius (H.Hara) Ohwi,,Geranium sibiricum var. glabrius (H.Hara) Ohwi,Plantae,Angiospermae,Dicotyledoneae,,GERANIACEAE,Geranium,Japan,Japan,,"Akkeshi-gun, Hamanaka-cho",,Hokkaido,Eastern Asia,Japan,,,,,,,,,,,,http://data.gbif.org/occurrences/388829532,http://data.gbif.org/ws/rest/occurrence/get?key=388829532
"National Museum of Nature and Science, Japan",Vascular Plant Specimen Database of Kanagawa Prefectural Museum of Natural History,,,,,,,KPM,NA,KPM-NA0064609,Specimen,,26:31.0,,,Geranium sibiricum L. var. glabrius (H.Hara) Ohwi,,Geranium sibiricum var. glabrius (H.Hara) Ohwi,Plantae,Angiospermae,Dicotyledoneae,,GERANIACEAE,Geranium,Japan,Japan,,"Tokoro-gun, Rubeshibe-cho",,Hokkaido,Eastern Asia,Japan,,,,,,,,,,,,http://data.gbif.org/occurrences/388829506,http://data.gbif.org/ws/rest/occurrence/get?key=388829506
"National Museum of Nature and Science, Japan",Vascular Plant Specimen Database of Kanagawa Prefectural Museum of Natural History,,,,,,,KPM,NA,KPM-NA0073347,Specimen,,26:31.0,,,Geranium sibiricum L. var. glabrius (H.Hara) Ohwi,,Geranium sibiricum var. glabrius (H.Hara) Ohwi,Plantae,Angiospermae,Dicotyledoneae,,GERANIACEAE,Geranium,Japan,Japan,,"Akkeshi-gun, Hamanaka-cho",,Hokkaido,Eastern Asia,Japan,,,,,,,,,,,,http://data.gbif.org/occurrences/388829533,http://data.gbif.org/ws/rest/occurrence/get?key=388829533
"National Museum of Nature and Science, Japan","Herbarium Specimens of Museum of Nature and Human Activities, Hyogo Prefecture, Japan",,,,,,,HYO,HYO-C,C1-048468,Specimen,,26:11.0,,,Geranium sibiricum L. var. glabrius (Hara) Ohwi,L.,Geranium sibiricum var. glabrius (Hara) Ohwi,Plantae,Magnoliophyta,Magnoliopsida,Geraniales,Geraniaceae,Geranium,Japan,Japan,,,,Hokkaido,Eastern Asia,Japan,,,,,,,,,5,,,http://data.gbif.org/occurrences/177359404,http://data.gbif.org/ws/rest/occurrence/get?key=177359404
"National Museum of Nature and Science, Japan","Herbarium Specimens of Museum of Nature and Human Activities, Hyogo Prefecture, Japan",,,,,,,HYO,HYO-C,C1-047344,Specimen,,26:11.0,,,Geranium sibiricum L. var. glabrius (Hara) Ohwi,L.,Geranium sibiricum var. glabrius (Hara) Ohwi,Plantae,Magnoliophyta,Magnoliopsida,Geraniales,Geraniaceae,Geranium,Japan,Japan,,,,Hokkaido,Eastern Asia,Japan,,,,,,,,,,,,http://data.gbif.org/occurrences/177359403,http://data.gbif.org/ws/rest/occurrence/get?key=177359403
"National Museum of Nature and Science, Japan","Herbarium Specimens of Museum of Nature and Human Activities, Hyogo Prefecture, Japan",,,,,,,HYO,HYO-C,C1-153468,Specimen,,26:11.0,,,Geranium sibiricum L. var. glabrius (Hara) Ohwi,L.,Geranium sibiricum var. glabrius (Hara) Ohwi,Plantae,Magnoliophyta,Magnoliopsida,Geraniales,Geraniaceae,Geranium,Japan,Japan,,,,Hokkaido,Eastern Asia,Japan,,,,,,,,,50,100,,http://data.gbif.org/occurrences/177359406,http://data.gbif.org/ws/rest/occurrence/get?key=177359406
"National Museum of Nature and Science, Japan","Herbarium Specimens of Museum of Nature and Human Activities, Hyogo Prefecture, Japan",,,,,,,HYO,HYO-C,C1-048512,Specimen,,26:11.0,,,Geranium sibiricum L. var. glabrius (Hara) Ohwi,L.,Geranium sibiricum var. glabrius (Hara) Ohwi,Plantae,Magnoliophyta,Magnoliopsida,Geraniales,Geraniaceae,Geranium,Japan,Japan,,,,Hokkaido,Eastern Asia,Japan,,,,,,,,,50,,,http://data.gbif.org/occurrences/177359405,http://data.gbif.org/ws/rest/occurrence/get?key=177359405
"National Museum of Nature and Science, Japan","Plant specimens depodited in Osaka Museum of Natural History, Japan.",,,,,,,OSA,C,OSA34004,Specimen,,19:42.0,,,Geranium sibiricum L. var. glabrius (Hara) Ohwi,L.,Geranium sibiricum var. glabrius (Hara) Ohwi,Plantae,,,,Geraniaceae,Geranium,Japan,Japan,Shanai,Esashi-gun Hamatonbetsu-cho,,Hokkaido Prefecture,Eastern Asia,Japan,,,,,,,,,,,,http://data.gbif.org/occurrences/295136891,http://data.gbif.org/ws/rest/occurrence/get?key=295136891
"National Museum of Nature and Science, Japan","Plant specimens depodited in Osaka Museum of Natural History, Japan.",,,,,,,OSA,C,OSA77136,Specimen,,19:44.0,,,Geranium sibiricum L. var. glabrius (Hara) Ohwi,,Geranium sibiricum var. glabrius (Hara) Ohwi,Plantae,,,,Geraniaceae,Geranium,Japan,Japan,,Kushiro-shi,,Hokkaido,Eastern Asia,Japan,,,,,,,,,,,,http://data.gbif.org/occurrences/295137232,http://data.gbif.org/ws/rest/occurrence/get?key=295137232
"National Institute of Genetics, ROIS","Herbarium Specimens of Museum of Nature and Human Activities, Hyogo Pref., Japan",,,,,,,HYO,VP,C1-047344,Specimen,,25:48.0,G.Murata,,Geranium sibiricum var. glabrius,,Geranium sibiricum var. glabrius,Plantae,Magnoliophyta,,,Geraniaceae,Geranium,Japan,Japan,"Kanzan-kyo,Shibecha-cho,Kawakami-gun",,,Hokkaido,Eastern Asia,Japan,,,,,,,,,,,,http://data.gbif.org/occurrences/323518687,http://data.gbif.org/ws/rest/occurrence/get?key=323518687
"National Institute of Genetics, ROIS","Herbarium Specimens of Museum of Nature and Human Activities, Hyogo Pref., Japan",,,,,,,HYO,VP,C1-048512,Specimen,,26:04.0,S.Tsugaru,,Geranium sibiricum var. glabrius,,Geranium sibiricum var. glabrius,Plantae,Magnoliophyta,,,Geraniaceae,Geranium,Japan,Japan,"Makinouchi, Nemuro-shi",,,Hokkaido,Eastern Asia,Japan,,,,,,,,,50,50,,http://data.gbif.org/occurrences/323520080,http://data.gbif.org/ws/rest/occurrence/get?key=323520080
"National Institute of Genetics, ROIS","Herbarium Specimens of Museum of Nature and Human Activities, Hyogo Pref., Japan",,,,,,,HYO,VP,C1-048468,Specimen,,26:23.0,G.Murata,,Geranium sibiricum var. glabrius,,Geranium sibiricum var. glabrius,Plantae,Magnoliophyta,,,Geraniaceae,Geranium,Japan,Japan,"near Atanoshike, Kushiro-shi",,,Hokkaido,Eastern Asia,Japan,,,,,,,,,5,5,,http://data.gbif.org/occurrences/323521953,http://data.gbif.org/ws/rest/occurrence/get?key=323521953
"National Institute of Genetics, ROIS","Herbarium Specimens of Museum of Nature and Human Activities, Hyogo Pref., Japan",,,,,,,HYO,VP,C1-153468,Specimen,,22:59.0,,,Geranium sibiricum var. glabrius,,Geranium sibiricum var. glabrius,Plantae,Magnoliophyta,,,Geraniaceae,Geranium,Japan,Japan,"Hokkaidou; Abashiri-shicho, Syari-cho.",,,Hokkaido,Eastern Asia,Japan,,,,,,,,,50,100,,http://data.gbif.org/occurrences/323503209,http://data.gbif.org/ws/rest/occurrence/get?key=323503209
